1-Cyclohexyl-1-propyne
- Formula: C9H14
- Molecular weight: 122.2075
- IUPAC Standard InChIKey: IWDWSCMNLSLHKQ-UHFFFAOYSA-N
- CAS Registry Number: 18736-95-3
- Chemical structure:
View 3d structure (requires JavaScript / HTML 5) - Permanent link for this species. Use this link for bookmarking this species for future reference.

Phase change data

Data compiled by: Robert L. Brown and Stephen E. Stein
Quantity | Value | Units | Method | Reference | Comment |
---|---|---|---|---|---|
Tboil | 435. to 437. | K | N/A | Farchan Laboratories, 1990 |

References

Farchan Laboratories, 1990
Farchan Laboratories,
Research Chemicals Catalog, Farchan Laboratories, Gainesville, FL, 1990, 91. [all data]