3-Heptanol, 6-methyl-
- Formula: C8H18O
- Molecular weight: 130.2279
- IUPAC Standard InChIKey: MNBIBGDICHMQFN-UHFFFAOYSA-N
- CAS Registry Number: 18720-66-6
- Chemical structure:
View 3d structure (requires JavaScript / HTML 5) - Other names: 6-Methyl-3-heptanol; 2-Methyl-5-heptanol; 6-Methylheptan-3-ol

Condensed phase thermochemistry data

Data compiled by: Eugene S. Domalski and Elizabeth D. Hearing
Constant pressure heat capacity of liquid
Cp,liquid (J/mol*K) | Temperature (K) | Reference | Comment |
---|---|---|---|
310.5 | 298.5 | Cline and Andrews, 1931 | T = 102 to 323 K. Value is unsmoothed experimental datum. |

Phase change data

Data compiled as indicated in comments:
TRC - Thermodynamics Research Center, NIST Boulder Laboratories, Chris Muzny director
AC - William E. Acree, Jr., James S. Chickos
Quantity | Value | Units | Method | Reference | Comment |
---|---|---|---|---|---|
Tboil | 442.85 | K | N/A | Henne and Matuszak, 1944 | Uncertainty assigned by TRC = 2. K; TRC |
Tboil | 431.65 | K | N/A | Dorough, Glass, et al., 1941 | Uncertainty assigned by TRC = 1. K; TRC |
Tboil | 438.65 | K | N/A | Kondo and Suzuki, 1936 | Uncertainty assigned by TRC = 5. K; TRC |
Tboil | 438.65 | K | N/A | Buelens, 1908 | Uncertainty assigned by TRC = 5. K; TRC |
Tboil | 438.65 | K | N/A | Henry, 1906 | Uncertainty assigned by TRC = 5. K; TRC |
Enthalpy of vaporization
ΔvapH (kJ/mol) | Temperature (K) | Method | Reference | Comment |
---|---|---|---|---|
47.6 | 348. | A | Stephenson and Malanowski, 1987 | Based on data from 333. to 432. K.; AC |

References

Cline and Andrews, 1931
Cline, J.K.; Andrews, D.H.,
Thermal energy studies. III. The octanols,
J. Am. Chem. Soc., 1931, 53, 3668-3673. [all data]
Henne and Matuszak, 1944
Henne, A.L.; Matuszak, A.H.,
The Dehydration of Secondary and Tertiary Alcohols,
J. Am. Chem. Soc., 1944, 66, 1649. [all data]
Dorough, Glass, et al., 1941
Dorough, G.L.; Glass, H.B.; Gresham, T.L.; Malone, G.B.; Reid, E.E.,
Structure-property relationships in some isomeric octanols,
J. Am. Chem. Soc., 1941, 63, 3100. [all data]
Kondo and Suzuki, 1936
Kondo; Suzuki,
Chem. Ber., 1936, 69, 2459. [all data]
Buelens, 1908
Buelens, A.,
Recl. Trav. Chim. Pays-Bas, 1908, 28, 113. [all data]
Henry, 1906
Henry, L.,
C. R. Hebd. Seances Acad. Sci., 1906, 143, 102. [all data]
Stephenson and Malanowski, 1987
Stephenson, Richard M.; Malanowski, Stanislaw,
Handbook of the Thermodynamics of Organic Compounds, 1987, https://doi.org/10.1007/978-94-009-3173-2
. [all data]