3-Heptanol, 5-methyl-
- Formula: C8H18O
- Molecular weight: 130.2279
- IUPAC Standard InChIKey: SECKOSOTZOBWEI-UHFFFAOYSA-N
- CAS Registry Number: 18720-65-5
- Chemical structure:
View 3d structure (requires JavaScript / HTML 5) - Other names: 5-Methyl-3-heptanol; 5-methylheptan-3-ol

Phase change data

Data compiled as indicated in comments:
TRC - Thermodynamics Research Center, NIST Boulder Laboratories, Chris Muzny director
AC - William E. Acree, Jr., James S. Chickos
Quantity | Value | Units | Method | Reference | Comment |
---|---|---|---|---|---|
Tboil | 426.55 | K | N/A | Dorough, Glass, et al., 1941 | Uncertainty assigned by TRC = 0.7 K; TRC |
Tboil | 428. | K | N/A | Powell and Secoy, 1931 | Uncertainty assigned by TRC = 3. K; TRC |
Tboil | 440.65 | K | N/A | Guerbet, 1912 | Uncertainty assigned by TRC = 5. K; TRC |
Quantity | Value | Units | Method | Reference | Comment |
Tc | 621.2 ± 0.5 | K | N/A | Gude and Teja, 1995 | |
Tc | 621.2 | K | N/A | Lawrenson and Lee, 1978 | Uncertainty assigned by TRC = 0.3 K; Visual, decomp.; TRC |
Enthalpy of vaporization
ΔvapH (kJ/mol) | Temperature (K) | Method | Reference | Comment |
---|---|---|---|---|
46.5 | 345. | A | Stephenson and Malanowski, 1987 | Based on data from 330. to 427. K. See also Wilhoit and Zwolinski, 1973.; AC |

Normal alkane RI, non-polar column, temperature ramp

View large format table.

Column type Active phase I Reference Comment
CapillaryOV-1942.Guan, Zheng, et al., 199250. m/0.32 mm/0.52 μm, H2, 1. K/min; Tstart: 30. C
CapillaryOV-1943.Guan, Zheng, et al., 199250. m/0.32 mm/0.52 μm, H2, 2. K/min; Tstart: 35. C

Normal alkane RI, non-polar column, custom temperature program

View large format table.

Column type Active phase I Reference Comment
CapillaryPolydimethyl siloxane944.Junkes, Castanho, et al., 2003Program: not specified

Normal alkane RI, polar column, temperature ramp

View large format table.

Column type Active phase I Reference Comment
CapillaryDB-Wax1296.Souza, Re-Poppi, et al., 201230. m/0.25 mm/0.25 μm, Helium, 60. C @ 1. min, 5. K/min; Tend: 240. C

References

Dorough, Glass, et al., 1941
Dorough, G.L.; Glass, H.B.; Gresham, T.L.; Malone, G.B.; Reid, E.E.,
Structure-property relationships in some isomeric octanols,
J. Am. Chem. Soc., 1941, 63, 3100. [all data]
Powell and Secoy, 1931
Powell, S.G.; Secoy, C.H.,
The Constitution of Homimesityl Oxide,
J. Am. Chem. Soc., 1931, 53, 765. [all data]
Guerbet, 1912
Guerbet, M.,
The effect of caustic potash on secondary alcohols,
Bull. Soc. Chim. Fr., 1912, 11, 276-84. [all data]
Gude and Teja, 1995
Gude, M.; Teja, A.S.,
Vapor-Liquid Critical Properties of Elements and Compounds. 4. Aliphatic Alkanols,
J. Chem. Eng. Data, 1995, 40, 1025-1036. [all data]
Lawrenson and Lee, 1978
Lawrenson, I.J.; Lee, D.A.,
Thermodynamic properties of organic oxygen compounds XLVIII. The critical temperature of some alkanols,
J. Chem. Thermodyn., 1978, 10, 1111. [all data]
Stephenson and Malanowski, 1987
Stephenson, Richard M.; Malanowski, Stanislaw,
Handbook of the Thermodynamics of Organic Compounds, 1987, https://doi.org/10.1007/978-94-009-3173-2
. [all data]
Wilhoit and Zwolinski, 1973
Wilhoit, R.C.; Zwolinski, B.J.,
Physical and thermodynamic properties of aliphatic alcohols,
J. Phys. Chem. Ref. Data Suppl., 1973, 1, 2, 1. [all data]