3-Heptanol, 2-methyl-
- Formula: C8H18O
- Molecular weight: 130.2279
- IUPAC Standard InChIKey: QGVFLDUEHSIZIG-UHFFFAOYSA-N
- CAS Registry Number: 18720-62-2
- Chemical structure:
View 3d structure (requires JavaScript / HTML 5) - Other names: 2-Methyl-3-heptanol; 2-Methylheptanol-(3); 2-Methylheptan-3-ol; 2-Methyl-1-heptene-3-ol; (dl) 2-methyl-3-heptanol

Phase change data

Data compiled as indicated in comments:
TRC - Thermodynamics Research Center, NIST Boulder Laboratories, Chris Muzny director
AC - William E. Acree, Jr., James S. Chickos
Quantity | Value | Units | Method | Reference | Comment |
---|---|---|---|---|---|
Tboil | 433. ± 10. | K | AVG | N/A | Average of 6 values; Individual data points |
Enthalpy of vaporization
ΔvapH (kJ/mol) | Temperature (K) | Method | Reference | Comment |
---|---|---|---|---|
54.8 | 364. | A | Stephenson and Malanowski, 1987 | Based on data from 349. to 441. K. See also Wilhoit and Zwolinski, 1973.; AC |

References

Stephenson and Malanowski, 1987
Stephenson, Richard M.; Malanowski, Stanislaw,
Handbook of the Thermodynamics of Organic Compounds, 1987, https://doi.org/10.1007/978-94-009-3173-2
. [all data]
Wilhoit and Zwolinski, 1973
Wilhoit, R.C.; Zwolinski, B.J.,
Physical and thermodynamic properties of aliphatic alcohols,
J. Phys. Chem. Ref. Data Suppl., 1973, 1, 2, 1. [all data]