(Z,Z)-1,3,5,7-Octatetraene
- Formula: C8H10
- Molecular weight: 106.1650
- IUPAC Standard InChIKey: VXQUABLSXKFKLO-SFECMWDFSA-N
- CAS Registry Number: 1871-50-7
- Chemical structure:
View 3d structure (requires JavaScript / HTML 5) - Stereoisomers:

Gas phase thermochemistry data

Data compiled by: Glushko Thermocenter, Russian Academy of Sciences, Moscow
Constant pressure heat capacity of gas
Cp,gas (J/mol*K) | Temperature (K) | Reference | Comment |
---|---|---|---|
52.4 | 50. | Thermodynamics Research Center, 1997 | |
72.0 | 100. | ||
88.6 | 150. | ||
105.9 | 200. | ||
134.3 | 273.15 | ||
144.4 | 298.15 | ||
145.2 | 300. | ||
184.7 | 400. | ||
218.9 | 500. | ||
247.3 | 600. | ||
270.7 | 700. | ||
290.4 | 800. | ||
307.1 | 900. | ||
321.4 | 1000. | ||
333.7 | 1100. | ||
344.3 | 1200. | ||
353.5 | 1300. | ||
361.5 | 1400. | ||
368.4 | 1500. |

References

Thermodynamics Research Center, 1997
Thermodynamics Research Center,
Selected Values of Properties of Chemical Compounds., Thermodynamics Research Center, Texas A&M University, College Station, Texas, 1997. [all data]