trans-Chlorfenvinphos
- Formula: C12H14Cl3O4P
- Molecular weight: 359.570
- IUPAC Standard InChIKey: FSAVDKDHPDSCTO-XYOKQWHBSA-N
- CAS Registry Number: 18708-86-6
- Chemical structure:
View 3d structure (requires JavaScript / HTML 5) - Species with the same structure:
- Stereoisomers:
- Other names: Phosphoric acid, 2-chloro-1-(2,4-dichlorophenyl)ethenyl diethyl ester, (E)-; Phosphoric acid, 2-chloro-1-(2,4-dichlorophenyl)vinyl diethyl ester, (E)-; trans-Isomer of chlorfenvinphos; Chlorfenvinphos (trans); (E)-Chlorfenvinfos; 2-Chloro-1-(2,4-dichlorophenyl)ethenyl diethyl phosphate, (E)-; α-Chlorfenvinphos; (E)-2-Chloro-1-(2,4-dichlorophenyl)ethenyl diethyl phosphate; Chlorfenvinphos E; Chlorfenvinphos (E), alpha; (E)-Chlorfenvinphos

Normal alkane RI, non-polar column, custom temperature program

Column type | Active phase | I | Reference | Comment |
---|---|---|---|---|
Capillary | 5 % Phenyl methyl siloxane | 2046. | Department of Food Safety and Welfare, 2006 | 30. m/0.25 mm/0.25 μm, Helium; Program: 50 0C(1 min) 25 0C/min -> 125 0C 10 0C/min -> 300 0C (10 min) |
Capillary | 5 % Phenyl methyl siloxane | 2048. | Department of Food Safety and Welfare, 2006 | 30. m/0.25 mm/0.25 μm, Helium; Program: 50 0C(1 min) 25 0C/min -> 125 0C 10 0C/min -> 300 0C (10 min) |

References

Department of Food Safety and Welfare, 2006
Department of Food Safety, Ministry of Health; Welfare,
Analytical methods for residual compositional substances of agricultural chemicals, feed aadditives, and veterinary drugs in foods, 2006, retrieved from http://www.mhlw.go.jp/english/topics/foodsafety/positivelist060228/de/060526-1a.pdf. [all data]