2(3H)-Furanone, dihydro-5-(2-octenyl)-, (Z)-
- Formula: C12H20O2
- Molecular weight: 196.2860
- IUPAC Standard InChIKey: QFXOXDSHNXAFEY-SREVYHEPSA-N
- CAS Registry Number: 18679-18-0
- Chemical structure:
View 3d structure (requires JavaScript / HTML 5) - Stereoisomers:
- Other names: cis-4-Hydroxydodec-6-enoic acid lactone; cis-6-Dodecen-4-olide; cis-γ-Dodec-6-enolactone; (Z)-4-Hydroxy-6-dodecenoic acid lactone; (Z)-6-Dodecen-4-olide; 5-[(2Z)-2-Octenyl]dihydro-2(3H)-furanone; γ-6-(Z)-Dodecenolactone; γ-Dodec-cis-6-enolactone; 6-(Z)-Dodecen-γ-lactone; (Z)-6-Dodecen-γ-lactone; (Z)-6-Dodeceno-γ-lactone; (Z)-6-Dodecenyl-γ-lactone; (Z)-Dodec-6-en-4-olide; 2(3H)-Furanone, dihydro-5-(2Z)-2-octen-1-yl-; cis-6-Dodecen-γ-lactone; (Z)-6-γ-Dodecenolactone; cis-γ-6-Dodecenolactone; (Z)-dihydro-5-(2-octenyl)furan-2(3H)-one

Van Den Dool and Kratz RI, non-polar column, temperature ramp

Column type | Active phase | I | Reference | Comment |
---|---|---|---|---|
Capillary | SPB-5 | 1680. | Engel and Ratel, 2007 | 60. m/0.32 mm/1. μm, 40. C @ 2. min, 3. K/min, 230. C @ 10. min |
Capillary | SE-54 | 1670. | Schlutt B., Moran N., et al., 2007 | He, 40. C @ 2. min, 8. K/min, 240. C @ 5. min; Column length: 50. m; Column diameter: 0.32 mm |
Capillary | DB-5MS | 1650. | Schwambach and Peterson, 2006 | 60. m/0.25 mm/0.25 μm, H2, 30. C @ 2. min, 2. K/min, 250. C @ 2. min |
Capillary | DB-5 | 1651. | Colahan-Sederstrom and Peterson, 2005 | 30. m/0.25 mm/0.25 μm, N2, 30. C @ 2. min, 3. K/min, 250. C @ 2. min |
Capillary | BPX-5 | 1676. | Dickschat J.S., Wagner-Dobler I., et al., 2005 | 25. m/0.25 mm/0.25 μm, He, 50. C @ 5. min, 5. K/min; Tend: 300. C |
Capillary | DB-5MS | 1662. | Karagül-Yüceer, Vlahovich, et al., 2003 | 30. m/0.25 mm/0.25 μm, He, 35. C @ 5. min, 10. K/min, 200. C @ 30. min |

Van Den Dool and Kratz RI, non-polar column, custom temperature program

Column type | Active phase | I | Reference | Comment |
---|---|---|---|---|
Capillary | DB-5 | 1656. | Zehentbauer and Reineccius, 2002 | 30. m/0.25 mm/0.25 μm, He; Program: 35 C (2 min) 40 C/min -> 50 C (2 min) 4 C/min -> 230 C |
Capillary | DB-5 | 1657. | Rychlik and Bosset, 2001 | 30. m/0.32 mm/0.25 μm, He; Program: 35C(2min) => 40C/min => 60C (2min) => 4C/min => 240C |
Capillary | SE-54 | 1663. | Kubícková and Grosch, 1997 | Column length: 30. m; Column diameter: 0.32 mm; Program: 35C (2min) => 40C/min => 50C (2min) => 4C/min => 250C (10min) |
Capillary | DB-5MS | 1675. | Milo and Reineccius, 1997 | 30. m/0.25 mm/0.5 μm; Program: 40C(2min) => 6C/min => 180C => 10C/min => 250C |

Van Den Dool and Kratz RI, polar column, temperature ramp

Column type | Active phase | I | Reference | Comment |
---|---|---|---|---|
Capillary | FFAP | 2435. | Schlutt B., Moran N., et al., 2007 | He, 40. C @ 2. min, 8. K/min, 240. C @ 5. min; Column length: 30. m; Column diameter: 0.32 mm |
Capillary | DB-Wax | 2405. | Schwambach and Peterson, 2006 | 60. m/0.25 mm/0.25 μm, H2, 30. C @ 2. min, 3. K/min, 230. C @ 4. min |
Capillary | DB-FFAP | 2385. | Colahan-Sederstrom and Peterson, 2005 | 30. m/0.25 mm/0.25 μm, N2, 30. C @ 2. min, 3. K/min, 250. C @ 2. min |
Capillary | DB-FFAP | 2393. | Avsar, Karagul-Yuceer, et al., 2004 | 15. m/0.32 mm/0.25 μm, He, 35. C @ 5. min, 10. K/min, 225. C @ 15. min |
Capillary | DB-FFAP | 2390. | Karagül-Yüceer, Vlahovich, et al., 2003 | 30. m/0.25 mm/0.25 μm, He, 35. C @ 5. min, 10. K/min, 200. C @ 30. min |

Van Den Dool and Kratz RI, polar column, custom temperature program

Column type | Active phase | I | Reference | Comment |
---|---|---|---|---|
Capillary | DB-FFAP | 2394. | Zehentbauer and Reineccius, 2002 | 30. m/0.25 mm/0.25 μm, He; Program: 35 0C (2 min) 40 K/min -> 60 0C (2 min) 6 K/min -> 230 0C |

Normal alkane RI, non-polar column, temperature ramp

Column type | Active phase | I | Reference | Comment |
---|---|---|---|---|
Capillary | HP-5 MS | 1661. | Lazarevic, Radulovic, et al., 2010 | 30. m/0.25 mm/0.25 μm, Helium, 5. K/min; Tstart: 70. C; Tend: 290. C |
Capillary | DB-5 | 1655. | Zeller and Rychlik, 2007 | 25. m/0.32 mm/0.25 μm, He, 40. C @ 1. min, 6. K/min; Tend: 230. C |

Normal alkane RI, non-polar column, custom temperature program

Column type | Active phase | I | Reference | Comment |
---|---|---|---|---|
Capillary | SE-54 | 1660. | Christlbauer and Schieberle, 2009 | 30. m/0.32 mm/0.25 μm, Helium; Program: 35 0C (2 min) 10 0C/min -> 50 0C (2 min) 6 0C/min -> 250 0C |
Capillary | DB-5 | 1670. | Buettner, 2007 | 30. m/0.32 mm/0.25 μm; Program: 40C(2min) => 40C/min => 60C(2min) => 6C/min => 180C => 15C/min => 230C(10min) |
Capillary | DB-5 | 1657. | Guth, 1997 | 30. m/0.32 mm/0.25 μm; Program: 35C (1min) => 40C/min => 60C (1min) => 6C/min => 250C (10min) |

Normal alkane RI, polar column, temperature ramp

Column type | Active phase | I | Reference | Comment |
---|---|---|---|---|
Capillary | FFAP | 2396. | Christlbauer and Schieberle, 2009 | 30. m/0.32 mm/0.25 μm, Helium, 40. C @ 2. min, 6. K/min; Tend: 240. C |
Capillary | DB-FFAP | 2393. | Zeller and Rychlik, 2007 | 30. m/0.32 mm/0.25 μm, He, 40. C @ 1. min, 6. K/min; Tend: 230. C |
Capillary | EC-1000 | 2425. | Bendall, 2001 | 30. m/0.25 mm/0.25 μm, He, 35. C @ 5. min, 5. K/min, 230. C @ 15. min |

Normal alkane RI, polar column, custom temperature program

Column type | Active phase | I | Reference | Comment |
---|---|---|---|---|
Capillary | EC-1000 | 2425. | Delabre and Bendall, 9999 | Program: not specified |
Capillary | DB-FFAP | 2380. | Buettner, 2007 | 30. m/0.32 mm/0.25 μm; Program: 40C(2min) => 40C/min => 60C(2min) => 6C/min => 180C => 15C/min => 230C(10min) |
Capillary | DB-FFAP | 2396. | Guth, 1997 | 30. m/0.32 mm/0.25 μm; Program: 35C (1min) => 40C/min => 60C (1min) => 6C/min => 250C (10min) |

References

Engel and Ratel, 2007
Engel, E.; Ratel, J.,
Correction of the data generated by mass spectrometry analyses of biological tissues: Application to food authentication,
J. Chromatogr. A, 2007, 1154, 1-2, 331-341, https://doi.org/10.1016/j.chroma.2007.02.012
. [all data]
Schlutt B., Moran N., et al., 2007
Schlutt B.; Moran N.; Schieberle P.; Hofmann T.,
Sensory-directed identification of creaminess-enhancing volatiles and semivolatiles in full-fat cream,
J. Agric. Food Chem., 2007, 55, 23, 9634-9645, https://doi.org/10.1021/jf0721545
. [all data]
Schwambach and Peterson, 2006
Schwambach, S.L.; Peterson, D.G.,
Reduction of Stale Flavor Development in Low-Heat Skim Milk Powder via Epicatechin Addition,
J. Agric. Food Chem., 2006, 54, 2, 502-508, https://doi.org/10.1021/jf0519764
. [all data]
Colahan-Sederstrom and Peterson, 2005
Colahan-Sederstrom, P.M.; Peterson, D.G.,
Inhibition of key aroma compound generated during ultrahigh-temperature processing of bovine milk via epicatechin addition,
J. Agric. Food Chem., 2005, 53, 2, 398-402, https://doi.org/10.1021/jf0487248
. [all data]
Dickschat J.S., Wagner-Dobler I., et al., 2005
Dickschat J.S.; Wagner-Dobler I.; Schulz S.,
The chafer pheromone buibuilactone and ant pyrazines are also produced by marine bacteria,
J. Chem. Ecol., 2005, 31, 4, 925-947, https://doi.org/10.1007/s10886-005-3553-9
. [all data]
Karagül-Yüceer, Vlahovich, et al., 2003
Karagül-Yüceer, Y.; Vlahovich, K.N.; Drake, M.A.; Cadwallader, K.R.,
Characteristic aroma components of rennet casein,
J. Agric. Food Chem., 2003, 51, 23, 6797-6801, https://doi.org/10.1021/jf0345806
. [all data]
Zehentbauer and Reineccius, 2002
Zehentbauer, G.; Reineccius, G.A.,
Determination of key aroma components of cheddar cheese using dynamic headspace dilution assay,
Flavour Fragr. J., 2002, 17, 4, 300-305, https://doi.org/10.1002/ffj.1102
. [all data]
Rychlik and Bosset, 2001
Rychlik, M.; Bosset, J.O.,
Flavour and off-flavour compoundsof SwissGruy ere cheese. Evaluation of potent odorants,
Int. Dairy J., 2001, 11, 11-12, 895-901, https://doi.org/10.1016/S0958-6946(01)00108-X
. [all data]
Kubícková and Grosch, 1997
Kubícková, J.; Grosch, W.,
Evaluation of potent odorants of camembert cheese by dilution and concentration techniques,
Int. Dairy J., 1997, 7, 1, 65-70, https://doi.org/10.1016/S0958-6946(96)00044-1
. [all data]
Milo and Reineccius, 1997
Milo, C.; Reineccius, G.A.,
Identification and quantification of potent odorants in regular-fat and low-fat mild cheddar cheese,
J. Agric. Food Chem., 1997, 45, 9, 3590-3594, https://doi.org/10.1021/jf970152m
. [all data]
Avsar, Karagul-Yuceer, et al., 2004
Avsar, Y.K.; Karagul-Yuceer, Y.; Drake, M.A.; Singh, T.K.; Yoon, Y.; Cadwallader, K.R.,
Characterization of nutty flavor in cheddar cheese,
J. Dairy Sci., 2004, 87, 7, 1999-2010, https://doi.org/10.3168/jds.S0022-0302(04)70017-X
. [all data]
Lazarevic, Radulovic, et al., 2010
Lazarevic, J.; Radulovic, N.; Palic, R.; Zlatkovic, B.,
Chemical Analusis of volatile constituents of Berula erecta (Hudson) Coville subsp. erecta (Apiaceae) from Serbia,
J. Essential Oil. Res., 2010, 22, 3, 153-156, https://doi.org/10.1080/10412905.2010.9700290
. [all data]
Zeller and Rychlik, 2007
Zeller, A.; Rychlik, M.,
Impact of estragole and other odorants on the flavour of anise and tarragon,
Flavour Fragr. J., 2007, 22, 2, 105-113, https://doi.org/10.1002/ffj.1765
. [all data]
Christlbauer and Schieberle, 2009
Christlbauer, M.; Schieberle, P.,
Characterization of the key aroma compounds in beef and pork vegetable gravies a la chef by application of the aroma extract dilution analysis,
J. Agric. Food Chem., 2009, 57, 19, 9114-9112, https://doi.org/10.1021/jf9023189
. [all data]
Buettner, 2007
Buettner, A.,
A selective and sensitive approach to characterize odour-active and volatile constituents in small-scale human milk samples,
Flavour Fragr. J., 2007, 22, 6, 465-473, https://doi.org/10.1002/ffj.1822
. [all data]
Guth, 1997
Guth, H.,
Identification of character impact odorants of different white wine varieties,
J. Agric. Food Chem., 1997, 45, 8, 3022-3026, https://doi.org/10.1021/jf9608433
. [all data]
Bendall, 2001
Bendall, J.G.,
Aroma compounds of fresh milk from New Zealand cows fed different diets,
J. Agric. Food Chem., 2001, 49, 10, 4825-4832, https://doi.org/10.1021/jf010334n
. [all data]
Delabre and Bendall, 9999
Delabre, M.-L.; Bendall, J.F.,
Flavour ingredients from fermented dairy streams,
Expression of Multidisciplinary Flavour Sci., 9999, 375-378. [all data]