Formic acid phenyl ester
- Formula: C7H6O2
- Molecular weight: 122.1213
- IUPAC Standard InChIKey: GEOWCLRLLWTHDN-UHFFFAOYSA-N
- CAS Registry Number: 1864-94-4
- Chemical structure:
View 3d structure (requires JavaScript / HTML 5) - Other names: Phenyl formate

Gas phase thermochemistry data

Data compiled by: Hussein Y. Afeefy, Joel F. Liebman, and Stephen E. Stein
Quantity | Value | Units | Method | Reference | Comment |
---|---|---|---|---|---|
ΔfH°gas | -215.7 ± 3.1 | kJ/mol | Ccb | Anthoney, Carson, et al., 1976 | See Anthoney, Carson, et al., 1975 |

Condensed phase thermochemistry data

Data compiled by: Hussein Y. Afeefy, Joel F. Liebman, and Stephen E. Stein
Quantity | Value | Units | Method | Reference | Comment |
---|---|---|---|---|---|
ΔfH°liquid | -268.6 ± 2.9 | kJ/mol | Ccb | Anthoney, Carson, et al., 1976 | See Anthoney, Carson, et al., 1975 |
Quantity | Value | Units | Method | Reference | Comment |
ΔcH°liquid | -3343.4 ± 2.8 | kJ/mol | Ccb | Anthoney, Carson, et al., 1976 | See Anthoney, Carson, et al., 1975; Corresponding ΔfHºliquid = -268.7 kJ/mol (simple calculation by NIST; no Washburn corrections) |

References

Anthoney, Carson, et al., 1976
Anthoney, M.E.; Carson, A.S.; Laye, P.G.,
Enthalpy of formation of phenyl formate and related bond dissociation energies,
J. Chem. Soc. Perkin Trans. 2, 1976, 1032-1036. [all data]
Anthoney, Carson, et al., 1975
Anthoney, M.E.; Carson, A.S.; Laye, P.G.,
The thermochemistry of formates and oxalates,
Conf. Int. Thermodyn. Chim. C.R. 4th, 1975, 1, 99-103. [all data]