3-Hexanone, 2,4-dimethyl-
- Formula: C8H16O
- Molecular weight: 128.2120
- IUPAC Standard InChIKey: PZAPVPGZDHJUTO-UHFFFAOYSA-N
- CAS Registry Number: 18641-70-8
- Chemical structure:
View 3d structure (requires JavaScript / HTML 5) - Other names: 2,4-Dimethyl-3-hexanone; 2,4-Dimethyl hexanone-3

Phase change data

Data compiled as indicated in comments:
TRC - Thermodynamics Research Center, NIST Boulder Laboratories, Chris Muzny director
AC - William E. Acree, Jr., James S. Chickos
Quantity | Value | Units | Method | Reference | Comment |
---|---|---|---|---|---|
Tboil | 420. | K | N/A | Cook, 1952 | Uncertainty assigned by TRC = 2. K; TRC |
Tboil | 418. | K | N/A | Whitmore, Whitmore, et al., 1950 | Uncertainty assigned by TRC = 3. K; TRC |
Tboil | 421. | K | N/A | Bryant and Smith, 1935 | Uncertainty assigned by TRC = 2. K; TRC |
Enthalpy of vaporization
ΔvapH (kJ/mol) | Temperature (K) | Method | Reference | Comment |
---|---|---|---|---|
42.5 | 365. | A | Stephenson and Malanowski, 1987 | Based on data from 350. to 418. K.; AC |

Van Den Dool and Kratz RI, polar column, temperature ramp

Column type | Active phase | I | Reference | Comment |
---|---|---|---|---|
Capillary | CP-Wax 52CB | 1178. | Liu, Yang, et al., 2001 | H2, 2. K/min; Column length: 50. m; Column diameter: 0.32 mm; Tstart: 50. C; Tend: 200. C |

References

Cook, 1952
Cook, N.C.,
, Unpublished, Final Rep. Stand. Proj. on Oxygenated Compounds, Penn. State Univ., College Park, PA, 1952. [all data]
Whitmore, Whitmore, et al., 1950
Whitmore, F.C.; Whitmore, H.E.; Cook, N.C.,
Hydrocarbons: X. Three New Octenes,
J. Am. Chem. Soc., 1950, 72, 51. [all data]
Bryant and Smith, 1935
Bryant, M.D.; Smith, D.M.,
Improved hydroxylamine method for the determination of aldehydes and ketones displacement of oxime equilibria by means of pyridine,
J. Am. Chem. Soc., 1935, 57, 57. [all data]
Stephenson and Malanowski, 1987
Stephenson, Richard M.; Malanowski, Stanislaw,
Handbook of the Thermodynamics of Organic Compounds, 1987, https://doi.org/10.1007/978-94-009-3173-2
. [all data]
Liu, Yang, et al., 2001
Liu, T.-T.; Yang, T.-S.; Wu, C.-M.,
Changes of volatiles in soy sauce-stewed pork during cold storage and reheating,
J. Sci. Food Agric., 2001, 81, 15, 1547-1552, https://doi.org/10.1002/jsfa.978
. [all data]