Cyclopropane, ethylidene-
- Formula: C5H8
- Molecular weight: 68.1170
- IUPAC Standard InChIKey: ZIFNDRXSSPCNID-UHFFFAOYSA-N
- CAS Registry Number: 18631-83-9
- Chemical structure:
View 3d structure (requires JavaScript / HTML 5) - Other names: Ethylidenecyclopropane

Reaction thermochemistry data

Data compiled by: Hussein Y. Afeefy, Joel F. Liebman, and Stephen E. Stein
Individual Reactions
Quantity | Value | Units | Method | Reference | Comment |
---|---|---|---|---|---|
ΔrH° | -155.0 ± 0.63 | kJ/mol | Chyd | Turner, Goebel, et al., 1968 | liquid phase; solvent: Acetic acid |

References

Turner, Goebel, et al., 1968
Turner, R.B.; Goebel, P.; Mallon, B.J.; Doering, W.E.; Coburn, J.F., Jr.; Pomerantz, M.,
Heats of hydrogenation. VIII. Compounds with three- and four-membered rings,
J. Am. Chem. Soc., 1968, 90, 4315-4322. [all data]