D-Leucylglycylglycine
- Formula: C10H19N3O4
- Molecular weight: 245.2756
- IUPAC Standard InChIKey: VWHGTYCRDRBSFI-ZETCQYMHSA-N
- CAS Registry Number: 18625-22-4
- Chemical structure:
View 3d structure (requires JavaScript / HTML 5) - Stereoisomers:
- Other names: Glycine, N-(N-D-leucylglycyl)-; N-(N-D-leucylglycyl)glycine

Condensed phase thermochemistry data

Data compiled by: Hussein Y. Afeefy, Joel F. Liebman, and Stephen E. Stein
Quantity | Value | Units | Method | Reference | Comment |
---|---|---|---|---|---|
ΔcH°solid | -5592.50 | kJ/mol | Ccb | Fischer and Wrede, 1904 | Heat of combustion corrected for pressure |

References

Fischer and Wrede, 1904
Fischer, E.; Wrede, F.,
Uber die Verbrennungswarme einiger organischer Verbindungen,
Sitzungsber. Dtsch. Akad. Wiss. Berlin Kl. Math. Phys. Tech., 1904, 687-715. [all data]