β-D-Xylopyranose, 4TMS derivative
- Formula: C17H42O5Si4
- Molecular weight: 438.8544
- IUPAC Standard InChIKey: KEOUSSOURMHEKN-TWMKSMIVSA-N
- CAS Registry Number: 18623-27-3
- Chemical structure:
View 3d structure (requires JavaScript / HTML 5) - Stereoisomers:
- α-D-Xylopyranose, 4TMS derivative
- A-Lyxopyranose, TMS
- A-Ribopyranose, TMS
- B-Arabinopyranose, TMS
- B-Lyxopyranose, TMS
- B-Ribopyranose, TMS
- A-Arabinopyranose, TMS
- α-D(-)-Lyxose, pyranose, TMS
- β-D(-)-Lyxose, pyranose, TMS
- α-D-(-)-Ribopyranose, 4TMS derivative
- β-D-(-)-Ribopyranose, 4TMS derivative
- β-D-(+)-Xylopyranose, 4TMS derivative
- D-Arabinopyranose, 4TMS derivative (isomer 1)
- D-Arabinopyranose, 4TMS derivative (isomer 2)
- DL-Arabinopyranose, 4TMS derivative
- β-D(-)-Lyxopyranose, 4TMS derivative
- α-D-(-)-Lyxopyranose, 4TMS derivative
- Other names: β-D-Xylopyranose, 1,2,3,4-tetrakis-O-(trimethylsilyl)-; Xylopyranose, 1,2,3,4-tetrakis-O-(trimethylsilyl)-, β-D-; 1,2,3,4-Tetrakis-O-(trimethylsilyl)-β-D-xylopyranose; β-D-Xylopyranose, tetrakis-TMS; β-Xylose, (4TMS); β-Xylopyranose, tetrakis-TMS; D-Xylopyranose, tetrakis(trimethylsilyl) ether; B-Xylopyranose, TMS; β-D-xylopyranose, TMS; D-(+)-Xylose, tetrakis(trimethylsilyl) ether; β-Xylose, TMS

Kovats' RI, non-polar column, isothermal

Column type | Active phase | Temperature (C) | I | Reference | Comment |
---|---|---|---|---|---|
Capillary | SE-54 | 180. | 1777. | García-Raso, Martínez-Castro, et al., 1987 | Column length: 40. m; Column diameter: 0.18 mm |
Capillary | SE-54 | 180. | 1777. | Paez, Martínez-Castro, et al., 1987 | Column length: 45. m; Column diameter: 0.18 mm |
Packed | SE-30 | 210. | 1782. | Saura-Calixto, Cañellas, et al., 1984 | N2, Supelcoport (80-100mesh); Column length: 3. m |

Kovats' RI, polar column, isothermal

Column type | Active phase | Temperature (C) | I | Reference | Comment |
---|---|---|---|---|---|
Capillary | Carbowax 20M | 160. | 1736. | García-Raso, Martínez-Castro, et al., 1987 | Column length: 25. m; Column diameter: 0.22 mm |

References

García-Raso, Martínez-Castro, et al., 1987
García-Raso, A.; Martínez-Castro, I.; Páez, M.I.; Sanz, J.; García-Raso, J.; Saura-Calixto, F.,
Gas Chromatographic Behaviour of Carbohydrate Trimethylsilyl Ethers. I. Aldopentoses,
J. Chromatogr., 1987, 398, 9-20, https://doi.org/10.1016/S0021-9673(01)96491-X
. [all data]
Paez, Martínez-Castro, et al., 1987
Paez, M.; Martínez-Castro, I.; Sanz, J.; Olano, A.; García-Raso, A.; Saura-Calixto, F.,
Identification of the components of aldoses in a tautomeric equilibrium mixture as their trimethylsilyl ethers by capillary cas chromatography,
Chromatographia, 1987, 23, 1, 43-46, https://doi.org/10.1007/BF02310417
. [all data]
Saura-Calixto, Cañellas, et al., 1984
Saura-Calixto, F.; Cañellas, J.; García-Raso, A.,
Gas chromatograph analysis of surgars and sugar-alcohols in the mesocarp, endocarp, and kernel of almond fruit,
J. Agric. Food Chem., 1984, 32, 5, 1018-1020, https://doi.org/10.1021/jf00125a017
. [all data]