2-Methyl-4-hydroxypyridine

Gas phase thermochemistry data

Data compiled by: Hussein Y. Afeefy, Joel F. Liebman, and Stephen E. Stein

Quantity Value Units Method Reference Comment
Δfgas-71.7 ± 1.7kJ/molCcbSuradi, El Saiad, et al., 1982

Condensed phase thermochemistry data

Data compiled by: Hussein Y. Afeefy, Joel F. Liebman, and Stephen E. Stein

Quantity Value Units Method Reference Comment
Δfsolid-184.7 ± 1.1kJ/molCcbSuradi, El Saiad, et al., 1982
Quantity Value Units Method Reference Comment
Δcsolid-3176.8 ± 0.7kJ/molCcbSuradi, El Saiad, et al., 1982

Phase change data

Data compiled as indicated in comments:
AC - William E. Acree, Jr., James S. Chickos
ALS - Hussein Y. Afeefy, Joel F. Liebman, and Stephen E. Stein

Quantity Value Units Method Reference Comment
Δsub139.0 ± 1.0kJ/molN/ARibeiro da Silva, Matos, et al., 1990AC
Δsub113.0 ± 1.3kJ/molCSuradi, El Saiad, et al., 1982ALS
Δsub113.0 ± 1.3kJ/molN/ASuradi, El Saiad, et al., 1982See also Pedley, Naylor, et al., 1986.; AC

Enthalpy of sublimation

ΔsubH (kJ/mol) Temperature (K) Method Reference Comment
132.2 ± 1.0433.MERibeiro da Silva, Matos, et al., 1990Based on data from 424. - 442. K.; AC

References

Suradi, El Saiad, et al., 1982
Suradi, S.; El Saiad, N.; Pilcher, G.; Skinner, H.A., Enthalpies of combustion of the three hydroxy-pyridines and the four hydroxy-2-methylpyridines, J. Chem. Thermodyn., 1982, 14, 45-50. [all data]

Ribeiro da Silva, Matos, et al., 1990
Ribeiro da Silva, M.A.V.; Matos, M.A.R.; Monte, M.J.S., Enthalpies of combustion, vapour pressures, and enthalpies of sublimation of 2-hydroxyquinoline, 4-methyl-2-hydroxyquinoline, 4-hydroxyquinoline, and 2-methyl-4-hydroxyquinoline, J. Chem. Thermodyn., 1990, 22, 609-616. [all data]

Pedley, Naylor, et al., 1986
Pedley, J.B.; Naylor, R.D.; Kirby, S.P., Thermochemical Data of Organic Compounds, 1986, https://doi.org/10.1007/978-94-009-4099-4 . [all data]