Benfluralin
- Formula: C13H16F3N3O4
- Molecular weight: 335.2790
- IUPAC Standard InChIKey: SMDHCQAYESWHAE-UHFFFAOYSA-N
- CAS Registry Number: 1861-40-1
- Chemical structure:

Phase change data

Data compiled as indicated in comments:
TRC - Thermodynamics Research Center, NIST Boulder Laboratories, Chris Muzny director
AC - William E. Acree, Jr., James S. Chickos
Quantity | Value | Units | Method | Reference | Comment |
---|---|---|---|---|---|
Tfus | 338.72 | K | N/A | Donnelly, Drewes, et al., 1990 | Uncertainty assigned by TRC = 0.2 K; TRC |
Enthalpy of fusion
ΔfusH (kcal/mol) | Temperature (K) | Reference | Comment |
---|---|---|---|
8.72 | 338.5 | Acree, 1991 | AC |

Kovats' RI, non-polar column, temperature ramp

Column type | Active phase | I | Reference | Comment |
---|---|---|---|---|
Capillary | DB-1 | 1672. | Hall, Whitehead, et al., 1986 | He, 6. K/min; Column length: 15. m; Column diameter: 0.25 mm; Tstart: 100. C; Tend: 270. C |
Capillary | DB-5 | 1704. | Hall, Whitehead, et al., 1986 | He, 6. K/min; Column length: 15. m; Column diameter: 0.25 mm; Tstart: 100. C; Tend: 270. C |

Kovats' RI, non-polar column, custom temperature program

Column type | Active phase | I | Reference | Comment |
---|---|---|---|---|
Capillary | HP-5 | 1670. | Tanabe, Mitobe, et al., 2000 | 30. m/0.32 mm/0.25 μm; Program: 50C(1min) => 20C/min => 150C => 10C/min => 280C(4min) |
Capillary | DB-5MS | 1672. | Tanabe, Mitobe, et al., 1996 | 30. m/0.32 mm/0.25 μm; Program: 50 C(1min)->20C/min->200C->10C/min->280C (1.5min) |

Van Den Dool and Kratz RI, non-polar column, temperature ramp

Column type | Active phase | I | Reference | Comment |
---|---|---|---|---|
Capillary | SLB-5MS | 1676. | Mondello, Casilli, et al., 2007 | 30. m/0.25 mm/0.25 μm, He, 2. K/min; Tstart: 70. C; Tend: 300. C |
Capillary | SLB-5MS | 1679. | Mondello, Casilli, et al., 2007 | 30. m/0.25 mm/0.25 μm, He, 2. K/min; Tstart: 70. C; Tend: 300. C |

Normal alkane RI, non-polar column, custom temperature program

Column type | Active phase | I | Reference | Comment |
---|---|---|---|---|
Capillary | 5 % Phenyl methyl siloxane | 1668. | Department of Food Safety and Welfare, 2006 | 30. m/0.25 mm/0.25 μm, Helium; Program: 50 0C(1 min) 25 0C/min -> 125 0C 10 0C/min -> 300 0C (10 min) |
Capillary | HP-5 | 1670. | Kawara, Asada, et al., 2005 | 30. m/0.25 mm/0.25 μm; Program: 50 0C (1 min) 20 0C/min -> 150 0C 10 0C/min -> 280 0C |
Capillary | Ultra-1 | 1665. | Tameo and Kiyos, 1991 | Program: not specified |

References

Donnelly, Drewes, et al., 1990
Donnelly, J.R.; Drewes, L.A.; Johnson, R.L.; Munslow, W.D.; Knapp, K.K.; Sovocool, G.W.,
Purity and heat of fusion data for environmental standards as determined by differential scanning calorimetry,
Thermochim. Acta, 1990, 167, 2, 155, https://doi.org/10.1016/0040-6031(90)80476-F
. [all data]
Acree, 1991
Acree, William E.,
Thermodynamic properties of organic compounds: enthalpy of fusion and melting point temperature compilation,
Thermochimica Acta, 1991, 189, 1, 37-56, https://doi.org/10.1016/0040-6031(91)87098-H
. [all data]
Hall, Whitehead, et al., 1986
Hall, G.L.; Whitehead, W.E.; Mourer, C.R.; Shibamoto, T.,
A new gas chromatographic retention index for pesticides and related compounds,
J. Hi. Res. Chromatogr. Chromatogr. Comm., 1986, 9, 5, 266-271, https://doi.org/10.1002/jhrc.1240090503
. [all data]
Tanabe, Mitobe, et al., 2000
Tanabe, A.; Mitobe, H.; Kawata, K.; Sakai, M.; Yasuhara, A.,
New monitoring system for ninety pesticides and related compounds in river water by solid-phase extraction with determination by gas chromatography/mass spectrometry,
J. AOAC Int., 2000, 83, 1, 61-77. [all data]
Tanabe, Mitobe, et al., 1996
Tanabe, A.; Mitobe, H.; Kawata, K.; Sakai, M.,
Monitoring of herbicides in river water by gas chromatography-mass spectrometry and solid-phase extraction,
J. Chromatogr. A, 1996, 754, 1-2, 159-168, https://doi.org/10.1016/S0021-9673(96)00221-X
. [all data]
Mondello, Casilli, et al., 2007
Mondello, L.; Casilli, A.; Tranchida, P.Q.; Presti, M.L.; Dugo, P.; Dugo, G.,
Comprehensive gas chromatography coupled to mass spectrometry for the separation of pesticides in a very complex matrix,
Anal. Bioanal. Chem., 2007, 389, 6, 1755-1763, https://doi.org/10.1007/s00216-007-1412-y
. [all data]
Department of Food Safety and Welfare, 2006
Department of Food Safety, Ministry of Health; Welfare,
Analytical methods for residual compositional substances of agricultural chemicals, feed aadditives, and veterinary drugs in foods, 2006, retrieved from http://www.mhlw.go.jp/english/topics/foodsafety/positivelist060228/de/060526-1a.pdf. [all data]
Kawara, Asada, et al., 2005
Kawara, K.; Asada, T.; Oikawa, K.; Tanabe, A.,
Multiresidue determination of pesticides in sediments by ultrasonically assisted extraction and gas chromatography/mass spectrometry,
J. AOAC International, 2005, 88, 5, 1440-1451. [all data]
Tameo and Kiyos, 1991
Tameo, O.; Kiyos, I.,
Simultaneous determination of pesticides by capillary gas chromatography,
Cannot be traslated (in Japan), 1991, 14, 2, 109-122. [all data]