2,4,6(1H,3H,5H)-Pyrimidinetrione, 1-methyl-5-(1-methylethyl)-5-(2-propenyl)-
- Formula: C11H16N2O3
- Molecular weight: 224.2563
- IUPAC Standard InChIKey: AXJXURWWUFZZKN-UHFFFAOYSA-N
- CAS Registry Number: 1861-21-8
- Chemical structure:

Phase change data

Data compiled by: Robert L. Brown and Stephen E. Stein
Quantity | Value | Units | Method | Reference | Comment |
---|---|---|---|---|---|
Tfus | 329. to 330. | K | N/A | Buckingham and Donaghy, 1982 |
Reduced pressure boiling point
Tboil (K) | Pressure (atm) | Reference |
---|---|---|
449. to 451. | 0.016 | Buckingham and Donaghy, 1982 |

Normal alkane RI, non-polar column, custom temperature program

Column type | Active phase | I | Reference | Comment |
---|---|---|---|---|
Other | Methyl Silicone | 1561. | Ardrey and Moffat, 1981 | Program: not specified |

References

Buckingham and Donaghy, 1982
Buckingham, J.; Donaghy, S.M.,
Dictionary of Organic Compounds: Fifth Edition, Chapman and Hall, New York, 1982, 1. [all data]
Ardrey and Moffat, 1981
Ardrey, R.E.; Moffat, A.C.,
Gas-liquid chromatographic retention indices of 1318 substances of toxicological interest on SE-30 or OV-1 stationary phase,
J. Chromatogr., 1981, 220, 3, 195-252, https://doi.org/10.1016/S0021-9673(00)81925-1
. [all data]