1-Hydroxy-L-proline
- Formula: C5H9NO3
- Molecular weight: 131.1299
- IUPAC Standard InChIKey: FGMPLJWBKKVCDB-SCSAIBSYSA-N
- CAS Registry Number: 18610-59-8
- Chemical structure:
View 3d structure (requires JavaScript / HTML 5) - Permanent link for this species. Use this link for bookmarking this species for future reference.

Condensed phase thermochemistry data

Data compiled by: Hussein Y. Afeefy, Joel F. Liebman, and Stephen E. Stein
Quantity | Value | Units | Method | Reference | Comment |
---|---|---|---|---|---|
ΔcH°solid | -2592.7 ± 1.8 | kJ/mol | Ccb | Ponomarev and Migarskaya, 1960 | Reanalyzed by Cox and Pilcher, 1970, Original value = -2593.5 ± 0.3 kJ/mol |

References

Ponomarev and Migarskaya, 1960
Ponomarev, V.V.; Migarskaya, L.B.,
Heats of combustion of some amino-acids,
Russ. J. Phys. Chem. (Engl. Transl.), 1960, 34, 1182-1183. [all data]
Cox and Pilcher, 1970
Cox, J.D.; Pilcher, G.,
Thermochemistry of Organic and Organometallic Compounds, Academic Press, New York, 1970, 1-636. [all data]
Saidel and Waldman, 1952
Saidel, L.J.; Waldman, S.,
J. Biol. Chem., 1952, 197, 285. [all data]