Hexanal, 5-methyl-
- Formula: C7H14O
- Molecular weight: 114.1855
- IUPAC Standard InChIKey: GEKRISJWBAIIAA-UHFFFAOYSA-N
- CAS Registry Number: 1860-39-5
- Chemical structure:
View 3d structure (requires JavaScript / HTML 5) - Other names: 5-Methylhexan-1-al; 5-methyl hexanal

Normal alkane RI, polar column, custom temperature program

Column type | Active phase | I | Reference | Comment |
---|---|---|---|---|
Capillary | CP-Wax 52CB | 1150. | Vernin, 1991 | Column length: 50. m; Column diameter: 0.32 mm; Program: not specified |

References

Vernin, 1991
Vernin, G.,
Volatile constituents of the essential oil of Santolina chamaecyparissus L.,
J. Essent. Oil Res., 1991, 3, 1, 49-53, https://doi.org/10.1080/10412905.1991.9697907
. [all data]