cyclohexenecarbonitrile
- Formula: C7H9N
- Molecular weight: 107.1531
- CAS Registry Number: 1855-63-6

Gas phase thermochemistry data

Data compiled by: Hussein Y. Afeefy, Joel F. Liebman, and Stephen E. Stein
Quantity | Value | Units | Method | Reference | Comment |
---|---|---|---|---|---|
ΔfH°gas | 24.27 | kcal/mol | Ccb | Prochazka, Krestanova, et al., 1970 |

Condensed phase thermochemistry data

Data compiled by: Hussein Y. Afeefy, Joel F. Liebman, and Stephen E. Stein
Quantity | Value | Units | Method | Reference | Comment |
---|---|---|---|---|---|
ΔfH°liquid | 11.47 | kcal/mol | Ccb | Prochazka, Krestanova, et al., 1970 | |
Quantity | Value | Units | Method | Reference | Comment |
ΔcH°liquid | -977.26 ± 0.66 | kcal/mol | Ccb | Prochazka, Krestanova, et al., 1970 |

Phase change data

Data compiled as indicated in comments:
BS - Robert L. Brown and Stephen E. Stein
ALS - Hussein Y. Afeefy, Joel F. Liebman, and Stephen E. Stein
DRB - Donald R. Burgess, Jr.
AC - William E. Acree, Jr., James S. Chickos
Quantity | Value | Units | Method | Reference | Comment |
---|---|---|---|---|---|
ΔvapH° | 12.80 | kcal/mol | N/A | Majer and Svoboda, 1985 | |
ΔvapH° | 12.80 ± 0.04 | kcal/mol | C | Prochazka, Krestanova, et al., 1970 | ALS |
ΔvapH° | 12.8 | kcal/mol | N/A | Prochazka, Krestanova, et al., 1970 | DRB |
ΔvapH° | 12.8 ± 0.02 | kcal/mol | C | Prochazka, Krestanova, et al., 1970 | AC |
Reduced pressure boiling point
Tboil (K) | Pressure (atm) | Reference | Comment |
---|---|---|---|
358. to 361. | 0.022 | Frinton Laboratories Inc., 1986 | BS |

References

Prochazka, Krestanova, et al., 1970
Prochazka, M.; Krestanova, V.; Konicek, J.; Smisek, M.,
Thermochemistry of nitriles. II. Alicyclic nitriles,
Collect. Czech. Chem. Commun., 1970, 35, 727-732. [all data]
Majer and Svoboda, 1985
Majer, V.; Svoboda, V.,
Enthalpies of Vaporization of Organic Compounds: A Critical Review and Data Compilation, Blackwell Scientific Publications, Oxford, 1985, 300. [all data]
Frinton Laboratories Inc., 1986
Frinton Laboratories Inc.,
Catalog Number 11, Frinton Laboratories Inc., Vineland, NJ, 1986, 99. [all data]