1-Undecene, 2-methyl-
- Formula: C12H24
- Molecular weight: 168.3190
- IUPAC Standard InChIKey: SJVKHZYVCVKEGM-UHFFFAOYSA-N
- CAS Registry Number: 18516-37-5
- Chemical structure:
View 3d structure (requires JavaScript / HTML 5) - Other names: 2-Methyl-1-undecene; 2-methylundec-1-ene

Van Den Dool and Kratz RI, non-polar column, custom temperature program

Column type | Active phase | I | Reference | Comment |
---|---|---|---|---|
Capillary | DB-5 | 1185. | Zaikin and Borisov, 2002 | He; Column length: 30. m; Column diameter: 0.25 mm; Program: 30C => 5K/min=120C => 10C/min => 270C |

Normal alkane RI, non-polar column, temperature ramp

Column type | Active phase | I | Reference | Comment |
---|---|---|---|---|
Capillary | Ultra-ALLOY-5 | 1186. | Tsuge, Ohtan, et al., 2011 | 30. m/0.25 mm/0.25 μm, 40. C @ 2. min, 20. K/min, 320. C @ 13. min |
Capillary | Ultra-ALLOY-5 | 1186. | Tsuge, Ohtan, et al., 2011 | 30. m/0.25 mm/0.25 μm, 40. C @ 2. min, 20. K/min, 320. C @ 13. min |

References

Zaikin and Borisov, 2002
Zaikin, V.G.; Borisov, R.S.,
Chromatographic-mass spectrometric analysis of Fishcer-Tropsch synthesis products,
J. Anal. Chem. USSR (Engl. Transl.), 2002, 57, 6, 544-551. [all data]
Tsuge, Ohtan, et al., 2011
Tsuge, S.; Ohtan, H.; Watanabe, C.,
Pyrolysis - GC/MS Data Book of Synthetic Polymers, Elsevier, 2011, 420. [all data]