strontium hydroxide
- Formula: H2O2Sr
- Molecular weight: 121.63
- IUPAC Standard InChIKey: UUCCCPNEFXQJEL-UHFFFAOYSA-L
- CAS Registry Number: 18480-07-4
- Chemical structure:
View 3d structure (requires JavaScript / HTML 5) - Permanent link for this species. Use this link for bookmarking this species for future reference.

Gas phase thermochemistry data

Quantity | Value | Units | Method | Reference | Comment |
---|---|---|---|---|---|
ΔfH°gas | -595.80 | kJ/mol | Review | Chase, 1998 | Data last reviewed in December, 1975 |
Quantity | Value | Units | Method | Reference | Comment |
S°gas,1 bar | 305.08 | J/mol*K | Review | Chase, 1998 | Data last reviewed in December, 1975 |
Gas Phase Heat Capacity (Shomate Equation)
Cp° = A + B*t + C*t2 + D*t3 +
E/t2
H° − H°298.15= A*t + B*t2/2 +
C*t3/3 + D*t4/4 − E/t + F − H
S° = A*ln(t) + B*t + C*t2/2 + D*t3/3 −
E/(2*t2) + G
Cp = heat capacity (J/mol*K)
H° = standard enthalpy (kJ/mol)
S° = standard entropy (J/mol*K)
t = temperature (K) / 1000.
View plot Requires a JavaScript / HTML 5 canvas capable browser.
Temperature (K) | 2000. to 6000. |
---|---|
A | 81.69846 |
B | 14.51367 |
C | -2.922508 |
D | 0.202265 |
E | -0.828968 |
F | -623.5666 |
G | 395.0830 |
H | -595.7974 |
Reference | Chase, 1998 |
Comment | Data last reviewed in December, 1975 |

Condensed phase thermochemistry data

Quantity Value Units Method Reference Comment
Δfliquid-957.30kJ/molReviewChase, 1998Data last reviewed in December, 1975
Quantity Value Units Method Reference Comment
liquid,1 bar108.73J/mol*KReviewChase, 1998Data last reviewed in December, 1975
Quantity Value Units Method Reference Comment
Δfsolid-968.89kJ/molReviewChase, 1998Data last reviewed in December, 1975
Quantity Value Units Method Reference Comment
solid97.07J/mol*KReviewChase, 1998Data last reviewed in December, 1975

Liquid Phase Heat Capacity (Shomate Equation)

Cp° = A + B*t + C*t2 + D*t3 + E/t2
H° − H°298.15= A*t + B*t2/2 + C*t3/3 + D*t4/4 − E/t + F − H
S° = A*ln(t) + B*t + C*t2/2 + D*t3/3 − E/(2*t2) + G
    Cp = heat capacity (J/mol*K)
    H° = standard enthalpy (kJ/mol)
    S° = standard entropy (J/mol*K)
    t = temperature (K) / 1000.

View plot Requires a JavaScript / HTML 5 canvas capable browser.

View table.

Temperature (K) 783.15 - 2000.
A 157.7372
B -2.179580×10-8
C 1.459337×10-8
D -3.253554×10-9
E -9.700438×10-10
F -1019.440
G 260.9983
H -957.3034
ReferenceChase, 1998
Comment Data last reviewed in December, 1975

Solid Phase Heat Capacity (Shomate Equation)

Cp° = A + B*t + C*t2 + D*t3 + E/t2
H° − H°298.15= A*t + B*t2/2 + C*t3/3 + D*t4/4 − E/t + F − H
S° = A*ln(t) + B*t + C*t2/2 + D*t3/3 − E/(2*t2) + G
    Cp = heat capacity (J/mol*K)
    H° = standard enthalpy (kJ/mol)
    S° = standard entropy (J/mol*K)
    t = temperature (K) / 1000.

View plot Requires a JavaScript / HTML 5 canvas capable browser.

View table.

Temperature (K) 298. - 783.15
A 36.00353
B 130.6270
C 2.484279
D -0.851842
E -0.022471
F -985.5286
G 101.4599
H -968.8889
ReferenceChase, 1998
Comment Data last reviewed in December, 1975

References

Chase, 1998
Chase, M.W., Jr.,
NIST-JANAF Themochemical Tables, Fourth Edition,
J. Phys. Chem. Ref. Data, Monograph 9, 1998, 1-1951. [all data]