2-Nonynoic acid
- Formula: C9H14O2
- Molecular weight: 154.2063
- IUPAC Standard InChIKey: ZAWLBSATNLQTON-UHFFFAOYSA-N
- CAS Registry Number: 1846-70-4
- Chemical structure:
View 3d structure (requires JavaScript / HTML 5) - Permanent link for this species. Use this link for bookmarking this species for future reference.

Condensed phase thermochemistry data

Data compiled as indicated in comments:
DRB - Donald R. Burgess, Jr.
ALS - Hussein Y. Afeefy, Joel F. Liebman, and Stephen E. Stein
Quantity | Value | Units | Method | Reference | Comment |
---|---|---|---|---|---|
ΔfH°liquid | -383.1 ± 5.0 | kJ/mol | Ccb | N/A | recalculated with modern CO2,H2O thermo; estimated uncertainty (NOTE all values in source also have wrong sign); DRB |
ΔfH°liquid | 428.4 | kJ/mol | Ccb | Moureu and Andre, 1914 | ALS |
Quantity | Value | Units | Method | Reference | Comment |
ΔcH°liquid | -5159.3 | kJ/mol | Ccb | Moureu and Andre, 1914 | Corresponding ΔfHºliquid = -383. kJ/mol (simple calculation by NIST; no Washburn corrections); ALS |

Phase change data

Data compiled by: Thermodynamics Research Center, NIST Boulder Laboratories, Chris Muzny director
Quantity | Value | Units | Method | Reference | Comment |
---|---|---|---|---|---|
Tfus | 265.15 | K | N/A | Moureu and Andre, 1914, 2 | Uncertainty assigned by TRC = 2. K |

References

Moureu and Andre, 1914
Moureu, C.; Andre, E.,
Thermochimie des composes acetyleniques,
Ann. Chim. Phys., 1914, 1, 113-145. [all data]
Moureu and Andre, 1914, 2
Moureu, C.; Andre, E.,
Thermochemistry of Acetylenic Compounds,
Ann. Chim. (Paris), 1914, 1, 113. [all data]