2-Methyl-4-propylphenol
- Formula: C10H14O
- Molecular weight: 150.2176
- IUPAC Standard InChIKey: LDQYTDPXIMNESL-UHFFFAOYSA-N
- CAS Registry Number: 18441-56-0
- Chemical structure:
View 3d structure (requires JavaScript / HTML 5) - Other names: Phenol, 2-methyl-4-propyl-; 4-propyl-o-cresol

Phase change data

Data compiled by: Thermodynamics Research Center, NIST Boulder Laboratories, Chris Muzny director
Quantity | Value | Units | Method | Reference | Comment |
---|---|---|---|---|---|
Tboil | 513.15 | K | N/A | Karr, 1957 | Uncertainty assigned by TRC = 4. K |
Tboil | 515.75 | K | N/A | Sy and Lejeune, 1957 | Uncertainty assigned by TRC = 3. K |
Tboil | 513.15 | K | N/A | White, 1954 | Uncertainty assigned by TRC = 5. K |
Quantity | Value | Units | Method | Reference | Comment |
Tfus | 316.65 | K | N/A | Karr, 1957 | Uncertainty assigned by TRC = 2. K |
Tfus | 316.65 | K | N/A | Sy and Lejeune, 1957 | Uncertainty assigned by TRC = 2. K |
Tfus | 316.65 | K | N/A | White, 1954 | Uncertainty assigned by TRC = 2. K |

Kovats' RI, non-polar column, temperature ramp

Column type | Active phase | I | Reference | Comment |
---|---|---|---|---|
Capillary | SE-30 | 1263. | Medvedovskaya, Tikhomirova, et al., 1997 | 7. K/min; Tstart: 50. C; Tend: 320. C |

References

Karr, 1957
Karr, C.,
, U. S. Bur. Mines, Inform. Circ. IC 7802, 1957. [all data]
Sy and Lejeune, 1957
Sy, M.; Lejeune, G.,
The Phenols of Coal Tar,
Chim. Ind. (Paris), 1957, 78, 619. [all data]
White, 1954
White, E.N.,
5th Tar Conf. Coal Tar Res. Assoc. Rept. 0124, 1954, England, 1954. [all data]