2,3-Xylenol, 6-ethyl-
- Formula: C10H14O
- Molecular weight: 150.2176
- IUPAC Standard InChIKey: DGWHZFYSJFCOMZ-UHFFFAOYSA-N
- CAS Registry Number: 18441-55-9
- Chemical structure:
View 3d structure (requires JavaScript / HTML 5) - Permanent link for this species. Use this link for bookmarking this species for future reference.

Phase change data

Data compiled by: Thermodynamics Research Center, NIST Boulder Laboratories, Chris Muzny director
Quantity | Value | Units | Method | Reference | Comment |
---|---|---|---|---|---|
Tboil | 513.15 | K | N/A | Karr, Estep, et al., 1961 | Uncertainty assigned by TRC = 5. K |
Quantity | Value | Units | Method | Reference | Comment |
Tfus | 326.65 | K | N/A | Karr, 1957 | Uncertainty assigned by TRC = 2. K |
Tfus | 325.65 | K | N/A | Mullins, 1953 | Uncertainty assigned by TRC = 2. K |
Tfus | 326.65 | K | N/A | Von Auwers and Mauss, 1928 | Uncertainty assigned by TRC = 2. K |

References

Karr, Estep, et al., 1961
Karr, C.; Estep, P.A.; Chang, T.-C.L.; Comberiati, H.R.,
, U. S. Bur. Mines, Bull. 591, 1961. [all data]
Karr, 1957
Karr, C.,
, U. S. Bur. Mines, Inform. Circ. IC 7802, 1957. [all data]
Mullins, 1953
Mullins, B.P.,
Fuel, 1953, 32, 481. [all data]
Von Auwers and Mauss, 1928
Von Auwers, K.; Mauss, W.,
Justus Liebigs Ann. Chem., 1928, 460, 240. [all data]