CAS Reg. No. 184378-98-1
- CAS Registry Number: 184378-98-1

Reaction thermochemistry data

Data compiled by: John E. Bartmess
Individual Reactions
(CAS Reg. No. 184378-98-1 • 4294967295) +
= CAS Reg. No. 184378-98-1
By formula: (CAS Reg. No. 184378-98-1 • 4294967295S) + S = CAS Reg. No. 184378-98-1
Quantity | Value | Units | Method | Reference | Comment |
---|---|---|---|---|---|
ΔrH° | 329. ± 7.9 | kJ/mol | N/A | Hunsicker, Jones, et al., 1995 | gas phase; Vertical Detachment Energy: 3.87 eV. |

References

Hunsicker, Jones, et al., 1995
Hunsicker, S.; Jones, R.O.; Gantefor, G.,
Rings and chains in sulfur cluster anions S- to S-9(-): Theory (simulated annealing) and experiment (photoelectron detachment),
J. Chem. Phys., 1995, 102, 15, 5917, https://doi.org/10.1063/1.469326
. [all data]