2-Fluoro-N-(2-fluoro-2,2-dinitroethyl)-N,2,2-trinitroethylamine
- Formula: C4H4F2N6O10
- Molecular weight: 334.1056
- IUPAC Standard InChIKey: FOEFXKNLSNSLOD-UHFFFAOYSA-N
- CAS Registry Number: 18432-39-8
- Chemical structure:
View 3d structure (requires JavaScript / HTML 5) - Permanent link for this species. Use this link for bookmarking this species for future reference.

Condensed phase thermochemistry data

Data compiled by: Hussein Y. Afeefy, Joel F. Liebman, and Stephen E. Stein
Quantity | Value | Units | Method | Reference | Comment |
---|---|---|---|---|---|
ΔfH°solid | -505. ± 3. | kJ/mol | Ccb | Kustova, Rubtsov, et al., 1976 | Insufficient ancillary data to correct to current CODATA ΔfH values |
ΔfH°solid | -512.7 ± 2.3 | kJ/mol | Ccr | Baroody and Carpenter, 1973 | Corrected for CODATA value of ΔfH; HF.100H2O |
ΔfH°solid | -505.13 | kJ/mol | Ccr | Baroody and Carpenter, 1972 | Not corrected for CODATA value of ΔfH |
Quantity | Value | Units | Method | Reference | Comment |
ΔcH°solid | -1999. ± 3. | kJ/mol | Ccb | Kustova, Rubtsov, et al., 1976 | Insufficient ancillary data to correct to current CODATA ΔfH values |

Reaction thermochemistry data

Data compiled by: Hussein Y. Afeefy, Joel F. Liebman, and Stephen E. Stein
Individual Reactions
By formula: C4H4F2N6O10 + 6O2 + C6H10O4 = 10CO2 + 2HF + 3N2 + 6H2O
Quantity | Value | Units | Method | Reference | Comment |
---|---|---|---|---|---|
ΔrH° | -4976.2 ± 2.3 | kJ/mol | Ccr | Baroody and Carpenter, 1973 | solid phase; Corrected for CODATA value of ΔfH; HF.100H2O |

References

Kustova, Rubtsov, et al., 1976
Kustova, L.V.; Rubtsov, Yu.I.; Kirpichev, E.P.; Eremenko, L.T.; Gafurov, R.G.; Korepin, A.G.,
The standard enthalpies of formation of certain N-(fluoropolynitroalkyl)-N-nitramines,
Russ. J. Phys. Chem. (Engl. Transl.), 1976, 50, 1150. [all data]
Baroody and Carpenter, 1973
Baroody, E.E.; Carpenter, G.A.,
Enthalpies of formation of some fluorodinitroethyl derivatives and 2,2',4,4',6,6'-hexanitroazobenzene,
J. Chem. Eng. Data, 1973, 18, 28-36. [all data]
Baroody and Carpenter, 1972
Baroody, E.E.; Carpenter, G.A.,
Heats of formation of propellant compounds (U), Rpt. Naval Ordnance Systems Command Task No. 331-003/067-1/UR2402-001 for Naval Ordance Station, Indian Head, MD, 1972, 1-9. [all data]