Cyclohexane, 1,2,3-trimethyl-, (1α,2α,3α)-
- Formula: C9H18
- Molecular weight: 126.2392
- IUPAC Standard InChIKey: DQTVJLHNWPRPPH-AYMMMOKOSA-N
- CAS Registry Number: 1839-88-9
- Chemical structure:
View 3d structure (requires JavaScript / HTML 5) - Stereoisomers:
- Other names: cis,cis,cis-1,2,3-Trimethylcyclohexane; 1,2,3-Trimethylcyclohexane,cis; 1,cis-2,cis-3-Trimethylcyclohexane; cis-1,2,3-Trimethylcyclohexane; Cyclohexane, 1,2,3-trimethyl-, cis

Phase change data

Data compiled by: Thermodynamics Research Center, NIST Boulder Laboratories, Chris Muzny director
Quantity | Value | Units | Method | Reference | Comment |
---|---|---|---|---|---|
Tboil | 424.58 | K | N/A | Bussert, Greenlee, et al., 1956 | Uncertainty assigned by TRC = 0.4 K |
Tboil | 424.15 | K | N/A | Chiurdoglu, Fierens, et al., 1950 | Uncertainty assigned by TRC = 0.7 K |

Kovats' RI, non-polar column, isothermal

Column type | Active phase | Temperature (C) | I | Reference | Comment |
---|---|---|---|---|---|
Capillary | Squalane | 86. | 869.5 | Nabivach, Bur'yan, et al., 1978 | Column length: 50. m; Column diameter: 0.25 mm |
Capillary | Squalane | 96. | 870.6 | Nabivach, Bur'yan, et al., 1978 | Column length: 50. m; Column diameter: 0.25 mm |
Capillary | Squalane | 100. | 920. | Mitra, Mohan, et al., 1974 | H2; Column length: 50. m; Column diameter: 0.2 mm |
Packed | SE-30 | 130. | 882. | Mitra and Saha, 1970 | N2 |

Van Den Dool and Kratz RI, non-polar column, temperature ramp

Column type | Active phase | I | Reference | Comment |
---|---|---|---|---|
Capillary | OV-101 | 901.1 | Yin, Liu, et al., 2001 | N2, 1. K/min; Column length: 80. m; Column diameter: 0.22 mm; Tstart: 30. C; Tend: 130. C |

Normal alkane RI, non-polar column, isothermal

Column type | Active phase | Temperature (C) | I | Reference | Comment |
---|---|---|---|---|---|
Capillary | OV-101 | 50. | 896. | Wu and Lu, 1984 | |
Capillary | OV-101 | 70. | 903. | Wu and Lu, 1984 |

References

Bussert, Greenlee, et al., 1956
Bussert, J.F.; Greenlee, K.W.; Derfer, J.M.; Boord, C.E.,
Synthesis of the Geometrical Isomers of 1,2,3-Trimethylcyclohexane,
J. Am. Chem. Soc., 1956, 78, 6076. [all data]
Chiurdoglu, Fierens, et al., 1950
Chiurdoglu, G.; Fierens, P.J.C.; Henkert, C.,
Equilibrium Isomerization of Cyclic Hydrocarbons II. Isomerization by Aluminum Chloride of Cyclophentane and Cyclohexane Hydrocarbons, C9H18,
Bull. Soc. Chim. Belg., 1950, 59, 156. [all data]
Nabivach, Bur'yan, et al., 1978
Nabivach, V.M.; Bur'yan, P.; Matsak, I.,
Retention indices of aromatic hydrocarbons on a squalane capillary column,
Zh. Anal. Khim., 1978, 33, 7, 1108-1113. [all data]
Mitra, Mohan, et al., 1974
Mitra, G.D.; Mohan, G.; Sinha, A.,
Gas chromatographic analysis of complex hydrocarbon mixtures,
J. Chromatogr. A, 1974, 91, 633-648, https://doi.org/10.1016/S0021-9673(01)97944-0
. [all data]
Mitra and Saha, 1970
Mitra, G.D.; Saha, N.C.,
Determination of Retention Indices of Saturated Hydrocarbons by Graphical Methods,
J. Chromatogr. Sci., 1970, 8, 2, 95-102, https://doi.org/10.1093/chromsci/8.2.95
. [all data]
Yin, Liu, et al., 2001
Yin, C.; Liu, W.; Li, Z.; Pan, Z.; Lin, T.; Zhang, M.,
Chemometrics to chemical modeling: structural coding in hydrocarbons and retention indices of gas chromatography,
J. Sep. Sci., 2001, 24, 3, 213-220, https://doi.org/10.1002/1615-9314(20010301)24:3<213::AID-JSSC213>3.0.CO;2-4
. [all data]
Wu and Lu, 1984
Wu, J.; Lu, W.,
Kovats indices of C4-C10 hydrocarbons in apolar quartz capillary OV-101,
Chin. J. Chromatogr., 1984, 1, 1, 11-17. [all data]