Silane, triethoxymethoxy-
- Formula: C7H18O4Si
- Molecular weight: 194.3009
- IUPAC Standard InChIKey: QYBKVVRRGQSGDC-UHFFFAOYSA-N
- CAS Registry Number: 18395-48-7
- Chemical structure:
View 3d structure (requires JavaScript / HTML 5) - Other names: Triethyl methyl orthosilicate; Silane, methoxy-, triethoxy-

Kovats' RI, non-polar column, isothermal

Column type | Active phase | Temperature (C) | I | Reference | Comment |
---|---|---|---|---|---|
Packed | Apiezon L | 160. | 812. | Ellrén, Peetre, et al., 1974 | N2, Chromosorb G |
Capillary | Apiezon L | 160. | 812.1 | Peetre, 1974 | Column length: 50. m; Column diameter: 0.25 mm |

Kovats' RI, non-polar column, custom temperature program

Column type | Active phase | I | Reference | Comment |
---|---|---|---|---|
Capillary | Apiezon L | 807. | Peetre, 1974 | Column length: 50. m; Column diameter: 0.25 mm; Program: not specified |

References

Ellrén, Peetre, et al., 1974
Ellrén, O.; Peetre, I.-B.; Smith, B.E.F.,
Gas chromatographic investigation of organometallic compounds and their carbon analogues. I. Determination, calculation and correlation of Kováts retention indices for tetraalkoxysilanes,
J. Chromatogr., 1974, 88, 2, 295-310, https://doi.org/10.1016/S0021-9673(00)83154-4
. [all data]
Peetre, 1974
Peetre, I.-B.,
Gas chromatographic investigation of organometallic compounds and their carbon analogues. II. Improved method for calculating retention indices of tetraalkoxysilanes,
J. Chromatogr., 1974, 88, 2, 311-321, https://doi.org/10.1016/S0021-9673(00)83155-6
. [all data]