1-Nonanol, TMS derivative
- Formula: C12H28OSi
- Molecular weight: 216.4356
- IUPAC Standard InChIKey: WZNQZZJRYURJIJ-UHFFFAOYSA-N
- CAS Registry Number: 18388-84-6
- Chemical structure:
View 3d structure (requires JavaScript / HTML 5) - Other names: Silane, trimethyl(nonyloxy)-; 1-Trimethylsilyloxynonane; Nonyl trimethylsilyl ether; 1-Nonanol, trimethylsilyl ether

Kovats' RI, non-polar column, isothermal

Column type | Active phase | Temperature (C) | I | Reference | Comment |
---|---|---|---|---|---|
Packed | SE-30 | 100. | 1270. | Zarazir, Chovin, et al., 1970 | Chromosorb W; Column length: 2. m |
Packed | SE-30 | 140. | 1265. | Zarazir, Chovin, et al., 1970 | Chromosorb W; Column length: 2. m |

Kovats' RI, polar column, isothermal

Column type | Active phase | Temperature (C) | I | Reference | Comment |
---|---|---|---|---|---|
Packed | Carbowax 20M | 100. | 1298. | Zarazir, Chovin, et al., 1970 | Chromosorb W; Column length: 2. m |
Packed | Carbowax 20M | 140. | 1275. | Zarazir, Chovin, et al., 1970 | Chromosorb W; Column length: 2. m |

Van Den Dool and Kratz RI, non-polar column, temperature ramp

Column type | Active phase | I | Reference | Comment |
---|---|---|---|---|
Capillary | DB-5 | 1289.8 | Richter, Komarek, et al., 1997 | 20. m/0.25 mm/0.25 μm, He, 5.5 K/min; Tstart: 50. C; Tend: 350. C |

Van Den Dool and Kratz RI, non-polar column, custom temperature program

Column type | Active phase | I | Reference | Comment |
---|---|---|---|---|
Capillary | VF-5MS | 1275. | Tret'yakov, 2007 | 30. m/0.25 mm/0.25 μm, He; Program: Multi-step temperature program; T(initial)=60C; T(final)=270C |

References

Zarazir, Chovin, et al., 1970
Zarazir, D.; Chovin, P.; Guiochon, G.,
Identification of hydroxylic compounds and their derivatives by gas chromatography,
Chromatographia, 1970, 3, 4, 180-195, https://doi.org/10.1007/BF02269018
. [all data]
Richter, Komarek, et al., 1997
Richter, P.; Komarek, K.; Reznicková, I.,
Identification of alkylpolyethylene glycols in the residues after biodegradation of their mixtures by CGC and previous derivatization,
Folia Microbiol. (Prague), 1997, 42, 5, 517-520, https://doi.org/10.1007/BF02826565
. [all data]
Tret'yakov, 2007
Tret'yakov, K.V.,
Retention Data. NIST Mass Spectrometry Data Center., NIST Mass Spectrometry Data Center, 2007. [all data]