4-Heptanol, 3-methyl-
- Formula: C8H18O
- Molecular weight: 130.2279
- IUPAC Standard InChIKey: JMRDKKYZLXDPLN-UHFFFAOYSA-N
- CAS Registry Number: 1838-73-9
- Chemical structure:
View 3d structure (requires JavaScript / HTML 5) - Other names: 3-Methyl-4-heptanol; 5-Methyl-4-heptanol; 3-methylheptan-4-ol; (dl) 3-methyl-4-heptanol

Phase change data

Data compiled as indicated in comments:
TRC - Thermodynamics Research Center, NIST Boulder Laboratories, Chris Muzny director
AC - William E. Acree, Jr., James S. Chickos
Quantity | Value | Units | Method | Reference | Comment |
---|---|---|---|---|---|
Tboil | 443.15 | K | N/A | Colonge, Descotes, et al., 1965 | Uncertainty assigned by TRC = 5. K; TRC |
Tboil | 437.85 | K | N/A | Dorough, Glass, et al., 1941 | Uncertainty assigned by TRC = 1. K; TRC |
Tboil | 433. | K | N/A | Rhinesmith, 1936 | Uncertainty assigned by TRC = 6. K; TRC |
Enthalpy of vaporization
ΔvapH (kJ/mol) | Temperature (K) | Method | Reference | Comment |
---|---|---|---|---|
48.0 | 355. | A | Stephenson and Malanowski, 1987 | Based on data from 340. to 438. K. See also Wilhoit and Zwolinski, 1973.; AC |

Normal alkane RI, non-polar column, custom temperature program

Column type | Active phase | I | Reference | Comment |
---|---|---|---|---|
Capillary | HP-5 | 997. | Timón, Ventanas, et al., 1998 | 50. m/0.32 mm/0.52 μm, He; Program: 35 0C 10 0C/min -> 200 0C (20 min) 5 0C/min -> 230 0C (50 min) |

References

Colonge, Descotes, et al., 1965
Colonge, J.; Descotes, G.; Bahurel, Y.,
Primary α-Methyl-α-ethylenic Alcohols,
Bull. Soc. Chim. Fr., 1965, 1965, 619-25. [all data]
Dorough, Glass, et al., 1941
Dorough, G.L.; Glass, H.B.; Gresham, T.L.; Malone, G.B.; Reid, E.E.,
Structure-property relationships in some isomeric octanols,
J. Am. Chem. Soc., 1941, 63, 3100. [all data]
Rhinesmith, 1936
Rhinesmith, H.S.,
Semicarbazones of Certain Ketones,
J. Am. Chem. Soc., 1936, 58, 596. [all data]
Stephenson and Malanowski, 1987
Stephenson, Richard M.; Malanowski, Stanislaw,
Handbook of the Thermodynamics of Organic Compounds, 1987, https://doi.org/10.1007/978-94-009-3173-2
. [all data]
Wilhoit and Zwolinski, 1973
Wilhoit, R.C.; Zwolinski, B.J.,
Physical and thermodynamic properties of aliphatic alcohols,
J. Phys. Chem. Ref. Data Suppl., 1973, 1, 2, 1. [all data]