cis-Chrysanthemyl alcohol
- Formula: C10H18O
- Molecular weight: 154.2493
- IUPAC Standard InChIKey: HIPIENNKVJCMAP-BDAKNGLRSA-N
- CAS Registry Number: 18383-59-0
- Chemical structure:
View 3d structure (requires JavaScript / HTML 5) - Stereoisomers:
- Other names: cis-Chrysanthemol; [2,2-Dimethyl-3-(2-methyl-1-propenyl)cyclopropyl]methanol, cis-; (Z)-Chrysanthemol; trans-Chrysanthemol; Chrysanthemyl alcohol (stereoisomer 1)

Kovats' RI, non-polar column, temperature ramp

Column type | Active phase | I | Reference | Comment |
---|---|---|---|---|
Capillary | HP-5 | 1168. | Oliveira, Leitao, et al., 2006 | 25. m/0.2 mm/0.33 μm, 3. K/min; Tstart: 60. C; Tend: 240. C |

Normal alkane RI, non-polar column, temperature ramp

Column type | Active phase | I | Reference | Comment |
---|---|---|---|---|
Capillary | DB-5 | 1163. | Tellez, Estell, et al., 1997 | 30. m/0.25 mm/0.25 μm, Helium, 3. K/min; Tstart: 60. C; Tend: 240. C |

Normal alkane RI, non-polar column, custom temperature program

Column type | Active phase | I | Reference | Comment |
---|---|---|---|---|
Capillary | SLB-5 MS | 1163. | Costa, De Fina, et al., 2008 | 30. m/0.25 mm/0.25 μm, Helium; Program: 50 0C 3 0C/min -> 250 0C (1 min) 10 0C/min -> 300 0C (5 min) |
Capillary | SLB-5 MS | 1160. | Costa, De Fina, et al., 2008 | 30. m/0.25 mm/0.25 μm, Helium; Program: not specified |
Capillary | SE-30 | 1152. | Vinogradov, 2004 | Program: not specified |
Capillary | Polydimethyl siloxanes | 1152. | Zenkevich, 1997 | Program: not specified |

Normal alkane RI, polar column, custom temperature program

Column type | Active phase | I | Reference | Comment |
---|---|---|---|---|
Capillary | HP-Innowax FSC | 1684. | Kürkcüoglu, Demirci, et al., 2003 | 60. m/0.25 mm/0.25 μm, He; Program: 60C(10min) => 4C/min => 220C(10min) => 1C/min => 240C(40min) |
Capillary | HP-Innowax | 1764. | Baser, Demirci, et al., 2001 | 60. m/0.25 mm/0.25 μm, He; Program: 60 0C (10 min) 10 K/min -> 220 0C (10 min) 1K/min -> 240 0C |
Capillary | HP-Innowax | 1684. | Baser, Demirci, et al., 2001 | 60. m/0.25 mm/0.25 μm, He; Program: 60 0C (10 min) 10 K/min -> 220 0C (10 min) 1K/min -> 240 0C |
Capillary | HP-Innowax | 1764. | Gören, Demirci, et al., 2001 | 60. m/0.25 mm/0.25 μm, He; Program: 60 0C (10 min) 4 K/min -> 220 0C (10 min) 1 K/min -> 240 0C |

References

Oliveira, Leitao, et al., 2006
Oliveira, D.R.; Leitao, G.G.; Santos, S.S.; Bizzo, H.R.; Lopes, D.; Alviano, C.S.; Alviano, D.S.; Leitao, S.G.,
Ethnopharmacological study of two Lippia species from Oriximina, Brazil,
J. Ethnopharmacol., 2006, 108, 1, 103-108, https://doi.org/10.1016/j.jep.2006.04.018
. [all data]
Tellez, Estell, et al., 1997
Tellez, M.R.; Estell, R.E.; Frederickson, E.L.; Havstad, K.M.,
Essntial oil of Flourensia cernua DC,
J. Essent. Oil Res., 1997, 9, 6, 619-624, https://doi.org/10.1080/10412905.1997.9700799
. [all data]
Costa, De Fina, et al., 2008
Costa, R.; De Fina, M.R.; Valentino, M.R.; Rustaiyan, A.; Dugo, P.; Dugo, G.; Mondello, L.,
An investigation on the volatile composition of some Artemisia species from Iran,
Flavour Fragr. J., 2008, 24, 2, 75-82, https://doi.org/10.1002/ffj.1919
. [all data]
Vinogradov, 2004
Vinogradov, B.A.,
Production, composition, properties and application of essential oils, 2004, retrieved from http://viness.narod.ru. [all data]
Zenkevich, 1997
Zenkevich, I.G.,
Analytical Parameters of Components of Essential Oils for their Chromatographic and Chromato-Spectral Identificaiton. Oxsigenated derivatives of Mono- and Sesquiterpene Hydrocarbons,
Rastit, Resursy (Rus.), 1997, 33, 1, 16-28. [all data]
Kürkcüoglu, Demirci, et al., 2003
Kürkcüoglu, M.; Demirci, B.; Tabanca, N.; Özek, T.; Baser, K.H.C.,
The essential oil of Achillea falcata L.,
Flavour Fragr. J., 2003, 18, 3, 192-194, https://doi.org/10.1002/ffj.1176
. [all data]
Baser, Demirci, et al., 2001
Baser, K.H.C.; Demirci, B.; Tabanca, N.; Özek, T.; Gören, N.,
Composition of the essential oils of Tanacetum armenum (DC.) Schultz Bip., T. balsamita L., T. chiliophyllum (Fisch. Mey.) Schultz Bip. var. chiliophyllum and T. haradjani (Rech. fil.) Grierson and the enantiomeric distribution of camphor and carvone,
Flavour Fragr. J., 2001, 16, 3, 195-200, https://doi.org/10.1002/ffj.977
. [all data]
Gören, Demirci, et al., 2001
Gören, N.; Demirci, B.; Baser, K.H.C.,
Composition of the essential oils of Tanacetum spp. from Turkey,
Flavour Fragr. J., 2001, 16, 3, 191-194, https://doi.org/10.1002/ffj.976
. [all data]