2-ethyl-2-methylbutan-1-ol
- Formula: C7H16O
- Molecular weight: 116.2013
- IUPAC Standard InChIKey: KMWHQWJVSALJAW-UHFFFAOYSA-N
- CAS Registry Number: 18371-13-6
- Chemical structure:
View 3d structure (requires JavaScript / HTML 5) - Other names: 2-Methyl-2-ethyl-1-butanol

Phase change data

Data compiled as indicated in comments:
TRC - Thermodynamics Research Center, NIST Boulder Laboratories, Chris Muzny director
AC - William E. Acree, Jr., James S. Chickos
Quantity | Value | Units | Method | Reference | Comment |
---|---|---|---|---|---|
Tboil | 429.65 | K | N/A | Searles, Pollart, et al., 1957 | Uncertainty assigned by TRC = 3. K; TRC |
Tboil | 423.65 | K | N/A | Rice, Jenkins, et al., 1938 | Uncertainty assigned by TRC = 3. K; TRC |
Enthalpy of vaporization
ΔvapH (kJ/mol) | Temperature (K) | Reference | Comment |
---|---|---|---|
55.7 | 373. | Wilhoit and Zwolinski, 1973 | Based on data from 358. to 428. K.; AC |

References

Searles, Pollart, et al., 1957
Searles, S.; Pollart, K.A.; Lutz, E.F.,
Oxetanes: vi reductive cleavage and substituent effects,
J. Am. Chem. Soc., 1957, 79, 948-51. [all data]
Rice, Jenkins, et al., 1938
Rice, R.V.; Jenkins, G.L.; Harden, W.C.,
J. Am. Pharm. Assoc., Sci. Ed., 1938, 27, 303. [all data]
Wilhoit and Zwolinski, 1973
Wilhoit, R.C.; Zwolinski, B.J.,
Physical and thermodynamic properties of aliphatic alcohols,
J. Phys. Chem. Ref. Data Suppl., 1973, 1, 2, 1. [all data]