Nitrofen
- Formula: C12H7Cl2NO3
- Molecular weight: 284.095
- IUPAC Standard InChIKey: XITQUSLLOSKDTB-UHFFFAOYSA-N
- CAS Registry Number: 1836-75-5
- Chemical structure:
View 3d structure (requires JavaScript / HTML 5) - Other names: Benzene, 2,4-dichloro-1-(4-nitrophenoxy)-; Ether, 2,4-dichlorophenyl p-nitrophenyl; FW 925; Niclofen; Nitraphen; Nitrochlor; Nitrophen; Nitrophene; NIP; TOK; TOK E 25; 2,4-Dichloro-4'-Nitrodiphenyl ether; 2,4-Dichlorophenyl p-nitrophenyl ether; 2,4-Dichlorophenyl 4-nitrophenyl ether; 4-(2,4-Dichlorophenoxy)nitrobenzene; 2',4'-Dichloro-4-nitrodiphenyl ether; 4'-Nitro-2,4-dichlorodiphenyl ether; 4-Nitro-2',4'-dichlorophenyl ether; Mezotox; Preparation 125; TOK E; TOK E 40; Trizilin; Trizilin 25

Phase change data

Data compiled as indicated in comments:
TRC - Thermodynamics Research Center, NIST Boulder Laboratories, Chris Muzny director
AC - William E. Acree, Jr., James S. Chickos
DH - Eugene S. Domalski and Elizabeth D. Hearing
Quantity | Value | Units | Method | Reference | Comment |
---|---|---|---|---|---|
Tfus | 342.72 | K | N/A | Donnelly, Drewes, et al., 1990 | Uncertainty assigned by TRC = 0.2 K; TRC |
Tfus | 343. | K | N/A | Vorob'ev, Borisov, et al., 1981 | Uncertainty assigned by TRC = 1. K; TRC |
Tfus | 344.7 | K | N/A | Plato and Glasgow, 1969 | Uncertainty assigned by TRC = 0.2 K; TRC |
Enthalpy of vaporization
ΔvapH (kJ/mol) | Temperature (K) | Method | Reference | Comment |
---|---|---|---|---|
90.4 | 343. | A | Stephenson and Malanowski, 1987 | Based on data from 328. to 403. K.; AC |
115.900 | 643. | N/A | Vorob'ev, Borisov, et al., 1981 | DH |
Entropy of vaporization
ΔvapS (J/mol*K) | Temperature (K) | Reference | Comment |
---|---|---|---|
180.2 | 643. | Vorob'ev, Borisov, et al., 1981 | DH |
Enthalpy of fusion
ΔfusH (kJ/mol) | Temperature (K) | Method | Reference | Comment |
---|---|---|---|---|
22.96 | 342. | DSC | Donnelly, Drewes, et al., 1990, 2 | AC |
2.700 | 343. | N/A | Vorob'ev, Borisov, et al., 1981 | DH |
Entropy of fusion
ΔfusS (J/mol*K) | Temperature (K) | Reference | Comment |
---|---|---|---|
7.87 | 343. | Vorob'ev, Borisov, et al., 1981 | DH |

References

Donnelly, Drewes, et al., 1990
Donnelly, J.R.; Drewes, L.A.; Johnson, R.L.; Munslow, W.D.; Knapp, K.K.; Sovocool, G.W.,
Purity and heat of fusion data for environmental standards as determined by differential scanning calorimetry,
Thermochim. Acta, 1990, 167, 2, 155, https://doi.org/10.1016/0040-6031(90)80476-F
. [all data]
Vorob'ev, Borisov, et al., 1981
Vorob'ev, G.I.; Borisov, N.N.; Novikova, G.A.; Efimova, V.L.,
Physicochemical properties of 2,4-dichloro-1-(4-nitrophenoxy)benzene,
Khim. Prom. (Moscow), 1981, (12), 728. [all data]
Plato and Glasgow, 1969
Plato, C.; Glasgow, A.R., Jr.,
Differential scanning calorimetry as a general method for determining the purity and heat of fusion of high-purity organic chemicals. Application to 95 compounds,
Anal. Chem., 1969, 41, 2, 330, https://doi.org/10.1021/ac60271a041
. [all data]
Stephenson and Malanowski, 1987
Stephenson, Richard M.; Malanowski, Stanislaw,
Handbook of the Thermodynamics of Organic Compounds, 1987, https://doi.org/10.1007/978-94-009-3173-2
. [all data]
Donnelly, Drewes, et al., 1990, 2
Donnelly, J.R.; Drewes, L.A.; Johnson, R.L.; Munslow, W.D.; Knapp, K.K.; Sovocool, G.W.,
Purity and heat of fusion data for environmental standards as determined by differential scanning calorimetry,
Thermochimica Acta, 1990, 167, 2, 155-187, https://doi.org/10.1016/0040-6031(90)80476-F
. [all data]