Thymidine, 3',5'-bis(trifluoroacetate)
- Formula: C14H12F6N2O7
- Molecular weight: 434.2447
- IUPAC Standard InChIKey: XOTHCHOYOROZPJ-UHFFFAOYSA-N
- CAS Registry Number: 18354-10-4
- Chemical structure:
View 3d structure (requires JavaScript / HTML 5) - Other names: O-3',5'-Bis(trifluoroacetyl)thymidine; Thymidine, 3',5'-bis-O-TFA

Kovats' RI, non-polar column, isothermal

Column type | Active phase | Temperature (C) | I | Reference | Comment |
---|---|---|---|---|---|
Packed | OV-1 | 205. | 2032. | Quilliam, Ogilvie, et al., 1980 | N2, Gas-Chrom Q |
Packed | OV-1 | 230. | 2053. | Quilliam, Ogilvie, et al., 1980 | N2, Gas-Chrom Q |

Van Den Dool and Kratz RI, non-polar column, custom temperature program

Column type | Active phase | I | Reference | Comment |
---|---|---|---|---|
Capillary | VF-5MS | 2054. | Tretyakov, 2011 | 30. m/0.25 mm/0.25 μm, He; Program: Multi-step temperature program; T(initial)=60C; T(final)=270C |

References

Quilliam, Ogilvie, et al., 1980
Quilliam, M.A.; Ogilvie, K.K.; Sadana, K.L.; Westmore, J.B.,
Gas chromatographic retention data for silyl and acyl derivatives of nucleosides,
J. Chromatogr., 1980, 196, 3, 367-378, https://doi.org/10.1016/S0021-9673(00)84739-1
. [all data]
Tretyakov, 2011
Tretyakov, K.V.,
Retention Data. NIST Mass Spectrometry Data Center., NIST Mass Spectrometry Data Center, 2011. [all data]