2-Bromo-3-methylbutane
- Formula: C5H11Br
- Molecular weight: 151.045
- IUPAC Standard InChIKey: BLGVDCMNIAOLHA-UHFFFAOYSA-N
- CAS Registry Number: 18295-25-5
- Chemical structure:
View 3d structure (requires JavaScript / HTML 5) - Species with the same structure:

Phase change data

Data compiled by: William E. Acree, Jr., James S. Chickos
Enthalpy of vaporization
ΔvapH (kJ/mol) | Temperature (K) | Method | Reference | Comment |
---|---|---|---|---|
37.2 | 316. | A | Stephenson and Malanowski, 1987 | Based on data from 301. to 430. K. See also Dykyj, 1972. |

References

Stephenson and Malanowski, 1987
Stephenson, Richard M.; Malanowski, Stanislaw,
Handbook of the Thermodynamics of Organic Compounds, 1987, https://doi.org/10.1007/978-94-009-3173-2
. [all data]
Dykyj, 1972
Dykyj, J.,
Petrochemia, 1972, 12, 1, 13. [all data]