1-Cyclohexenylacetic acid
- Formula: C8H12O2
- Molecular weight: 140.1797
- IUPAC Standard InChIKey: KDFBPHXESBPHTK-UHFFFAOYSA-N
- CAS Registry Number: 18294-87-6
- Chemical structure:
View 3d structure (requires JavaScript / HTML 5) - Other names: 1-Cyclohexene-1-acetic acid; cyclohex-1-enylacetic acid

Phase change data

Data compiled by: Robert L. Brown and Stephen E. Stein
Reduced pressure boiling point
Tboil (K) | Pressure (bar) | Reference |
---|---|---|
413. to 415. | 0.033 | Frinton Laboratories Inc., 1986 |

References

Frinton Laboratories Inc., 1986
Frinton Laboratories Inc.,
Catalog Number 11, Frinton Laboratories Inc., Vineland, NJ, 1986, 99. [all data]