Bromoacetic acid, TMS derivative
- Formula: C5H11BrO2Si
- Molecular weight: 211.129
- IUPAC Standard InChIKey: ZCHHFMWUDHXPFN-UHFFFAOYSA-N
- CAS Registry Number: 18291-80-0
- Chemical structure:
View 3d structure (requires JavaScript / HTML 5) - Other names: Trimethylsilyl bromoacetate; Acetic acid, bromo-, trimethylsilyl ester

Phase change data

Data compiled by: Robert L. Brown and Stephen E. Stein
Reduced pressure boiling point
Tboil (K) | Pressure (bar) | Reference |
---|---|---|
333. to 334. | 0.013 | Farchan Laboratories, 1990 |

References

Farchan Laboratories, 1990
Farchan Laboratories,
Research Chemicals Catalog, Farchan Laboratories, Gainesville, FL, 1990, 91. [all data]