Benzene, 4-bromo-1,2-dichloro-
- Formula: C6H3BrCl2
- Molecular weight: 225.898
- IUPAC Standard InChIKey: CFPZDVAZISWERM-UHFFFAOYSA-N
- CAS Registry Number: 18282-59-2
- Chemical structure:
View 3d structure (requires JavaScript / HTML 5) - Other names: 1-Bromo-3,4-dichlorobenzene; 3,4-Dichlorobromobenzene; Benzene, 1-bromo-3,4-dichloro-; 4-Bromo-1,2-dichlorobenzene

Phase change data

Data compiled by: Robert L. Brown and Stephen E. Stein
Quantity | Value | Units | Method | Reference | Comment |
---|---|---|---|---|---|
Tboil | 510.2 | K | N/A | Weast and Grasselli, 1989 | |
Tboil | 510. | K | N/A | Buckingham and Donaghy, 1982 | |
Quantity | Value | Units | Method | Reference | Comment |
Tfus | 297.6 | K | N/A | Buckingham and Donaghy, 1982 |
Reduced pressure boiling point
Tboil (K) | Pressure (bar) | Reference |
---|---|---|
397.2 | 0.044 | Weast and Grasselli, 1989 |
397. | 0.044 | Buckingham and Donaghy, 1982 |

References

Weast and Grasselli, 1989
CRC Handbook of Data on Organic Compounds, 2nd Editon, Weast,R.C and Grasselli, J.G., ed(s)., CRC Press, Inc., Boca Raton, FL, 1989, 1. [all data]
Buckingham and Donaghy, 1982
Buckingham, J.; Donaghy, S.M.,
Dictionary of Organic Compounds: Fifth Edition, Chapman and Hall, New York, 1982, 1. [all data]