CAS Reg. No. 18282-39-8
- CAS Registry Number: 18282-39-8

Reaction thermochemistry data

Data compiled by: John E. Bartmess
Individual Reactions
(CAS Reg. No. 18282-39-8 • 4294967295) +
= CAS Reg. No. 18282-39-8
By formula: (CAS Reg. No. 18282-39-8 • 4294967295Te) + Te = CAS Reg. No. 18282-39-8
Quantity | Value | Units | Method | Reference | Comment |
---|---|---|---|---|---|
ΔrH° | 242. ± 9.2 | kJ/mol | Ther | Gal, Maria, et al., 1989 | gas phase |
ΔrH° | 386.1 ± 2.7 | kJ/mol | N/A | Freidhoff, Snodgrass, et al., 1986 | gas phase |

References

Gal, Maria, et al., 1989
Gal, J.-F.; Maria, P.-C.; Decouzon, M.,
The Gas-Phase Acidity and Bond Dissociation Energies of Hydrogen Telluride,
Int. J. Mass Spectrom. Ion Proc., 1989, 93, 1, 87, https://doi.org/10.1016/0168-1176(89)83076-9
. [all data]
Freidhoff, Snodgrass, et al., 1986
Freidhoff, C.B.; Snodgrass, J.T.; Coe, J.V.; McHugh, K.M.; Bowen, K.H.,
Negative ion photoelectron spectroscopy of TeH-,
J. Chem. Phys., 1986, 84, 1051. [all data]