Methylphosphonic acid, 2TMS derivative
- Formula: C7H21O3PSi2
- Molecular weight: 240.3846
- IUPAC Standard InChIKey: KFHCUPQNEZPPQU-UHFFFAOYSA-N
- CAS Registry Number: 18279-83-9
- Chemical structure:
View 3d structure (requires JavaScript / HTML 5) - Other names: Phosphonic acid, methyl-, bis(trimethylsilyl) ester; Methylphosphonic acid (TMS-derivative); Methylphosphonic acid, bis(trimethylsilyl) ester; Bis(trimethylsilyl)methylphosphonate; Methylphosphonic acid, bis-TMS

Van Den Dool and Kratz RI, non-polar column, temperature ramp

Column type | Active phase | I | Reference | Comment |
---|---|---|---|---|
Capillary | SE-54 | 1154. | Kostiainen, 2000 | 25. m/0.32 mm/0.25 μm, He, 40. C @ 1. min, 10. K/min, 280. C @ 10. min |

Normal alkane RI, non-polar column, temperature ramp

Column type | Active phase | I | Reference | Comment |
---|---|---|---|---|
Capillary | DB-5 | 1142. | Savel'eva, Zenkevich, et al., 2003 | 25. m/0.20 mm/0.33 μm, Helium, 40. C @ 1. min, 5. K/min, 270. C @ 15. min |
Capillary | DB-5 | 1147. | Savel'eva, Zenkevich, et al., 2002 | 25. m/0.20 mm/0.33 μm, Helium, 40. C @ 1. min, 5. K/min, 270. C @ 15. min |

Normal alkane RI, non-polar column, custom temperature program

Column type | Active phase | I | Reference | Comment |
---|---|---|---|---|
Capillary | DB-5 | 1147. | Saveljeva, Zenkevich, et al., 2003 | He; Program: not specified |
Capillary | Methyl Silicone | 1142. | Savelieva and Zenkevich I., 2003 | Program: not specified |
Capillary | 5 % Phenyl methyl siloxane | 1154. | OPCW, 1997 | Program: not specified |

References

Kostiainen, 2000
Kostiainen, O.,
Gas Chromatography in Screening of Chemicals Related to the Chemical Weapons Convention
in Encyclopedia of Analytical Chemistry, Meyers, R.A., ed(s)., John Wiley Sons Ltd, Chichester, 2000, 963-979. [all data]
Savel'eva, Zenkevich, et al., 2003
Savel'eva, E.I.; Zenkevich, I.G.; Radilov, A.S.,
Identification the Products of Chemical Neutralization of O-Isobutyl-S-(2-diethylaminoethyl)methylthiophosphonate in the Composition of Bitumen-Salt Matrices,
Zh. Anal. Khim. (Rus.), 2003, 58, 2, 135-145. [all data]
Savel'eva, Zenkevich, et al., 2002
Savel'eva, E.I.; Zenkevich, I.G.; Kuznetsova, T.A.; Radilov, A.S.; Pshenichnaya, G.V.,
Investigation of Products of Transformation of Phosphororganic Toxic Substances with Gas Chromatography - Mass Spectrometry,
Rus. Khim. Zh. (Rus.), 2002, 56, 6, 82-91. [all data]
Saveljeva, Zenkevich, et al., 2003
Saveljeva, E.; Zenkevich, I.; Radilov, A.,
Identification of chemical neutralization and products of organophosphorus chemical warfare agents, 2003, retrieved from http://www.shimadzu.com/apps/form.cfm. [all data]
Savelieva and Zenkevich I., 2003
Savelieva, E.; Zenkevich I.,
Analisi GC/MS di agenti chimici nervini,
Laboratorio 2000, 2003, 17, 6/7, 24-26. [all data]
OPCW, 1997
OPCW,
Conference of the States Parties C-I/DEC.64 (22 May 1997), 1997, retrieved from http://www.opcw.org/html/global/cseries/csp1/CIDEC64.html. [all data]