N,N,N',N'-Tetrafluoro-1,1-cyclohexanediamine

Condensed phase thermochemistry data

Data compiled by: Hussein Y. Afeefy, Joel F. Liebman, and Stephen E. Stein

Quantity Value Units Method Reference Comment
Δfliquid-218.4 ± 3.5kJ/molCcbPepekin and Apin, 1972Reanalyzed by Pedley, Naylor, et al., 1986, Original value = -220. ± 2. kJ/mol
Quantity Value Units Method Reference Comment
Δcliquid-4288. ± 2.kJ/molCcbPepekin and Apin, 1972

Gas phase thermochemistry data

Data compiled by: Hussein Y. Afeefy, Joel F. Liebman, and Stephen E. Stein

Quantity Value Units Method Reference Comment
Δfgas-174.1 ± 3.6kJ/molCcbPepekin and Apin, 1972Reanalyzed by Pedley, Naylor, et al., 1986, Original value = -175. ± 3. kJ/mol

References

Pepekin and Apin, 1972
Pepekin, V.I.; Apin, A.Ya., Enthalpy of formation of 1,1-bis(difluoroamino)cyclohexane, Bull. Acad. Sci. USSR, Div. Chem. Sci., 1972, 2298-2299. [all data]

Pedley, Naylor, et al., 1986
Pedley, J.B.; Naylor, R.D.; Kirby, S.P., Thermochemical Data of Organic Compounds, Chapman and Hall, New York, 1986, 1-792. [all data]