2,2,2-trichloro-1-methoxyethanol
- IUPAC Standard InChIKey: LVMUSFXOLZJHFU-UHFFFAOYSA-N
- CAS Registry Number: 18271-82-4
- Chemical structure:
View 3d structure (requires JavaScript / HTML 5) - Permanent link for this species. Use this link for bookmarking this species for future reference.

Reaction thermochemistry data

Data compiled by: Hussein Y. Afeefy, Joel F. Liebman, and Stephen E. Stein
Individual Reactions
By formula: CH4O + C2HCl3O = 2,2,2-trichloro-1-methoxyethanol
Quantity | Value | Units | Method | Reference | Comment |
---|---|---|---|---|---|
ΔrH° | -48.1 | kJ/mol | Eqk | Jensen and Pedersen, 1971 | liquid phase; solvent: Heptane |

References

Jensen and Pedersen, 1971
Jensen, R.B.; Pedersen, S.B.,
Reaction between chloral and alcohols. 9. Dissociation of chloral hemiacetals of some aliphatic primary and secondary alcohols,
Acta Chem. Scand., 1971, 25, 2911-2930. [all data]