1-Amino-3-nitroguanidine
- Formula: CH5N5O2
- Molecular weight: 119.0827
- IUPAC Standard InChIKey: LWPLPMSGDZDOLW-UHFFFAOYSA-N
- CAS Registry Number: 18264-75-0
- Chemical structure:
View 3d structure (requires JavaScript / HTML 5) - Species with the same structure:
- Other names: N-nitrocarbazamidine

Phase change data

Data compiled by: Thermodynamics Research Center, NIST Boulder Laboratories, Chris Muzny director
Quantity | Value | Units | Method | Reference | Comment |
---|---|---|---|---|---|
Tfus | 484.65 | K | N/A | Popp, 1964 | Uncertainty assigned by TRC = 2.5 K |

References

Popp, 1964
Popp, F.D.,
Some Derivatives of 3-Bromobenzaldehyde,
J. Chem. Eng. Data, 1964, 9, 381. [all data]