Trichloro(ethoxy)silane
- Formula: C2H5Cl3OSi
- Molecular weight: 179.505
- IUPAC Standard InChIKey: SELBPKHVKHQTIB-UHFFFAOYSA-N
- CAS Registry Number: 1825-82-7
- Chemical structure:
View 3d structure (requires JavaScript / HTML 5) - Other names: Silane, trichloroethoxy-

Kovats' RI, non-polar column, isothermal

Column type | Active phase | Temperature (C) | I | Reference | Comment |
---|---|---|---|---|---|
Packed | SE-30 | 100. | 655. | Kreshkov, Kirichenko, et al., 1975 | Ar; Column length: 1. m |
Packed | SE-30 | 150. | 646. | Kreshkov, Kirichenko, et al., 1975 | Ar; Column length: 1. m |
Packed | Apiezon L | 100. | 676. | Kreshkov, Kirichenko, et al., 1975 | Ar; Column length: 1. m |
Packed | Apiezon L | 150. | 704. | Kreshkov, Kirichenko, et al., 1975 | Ar; Column length: 1. m |

Normal alkane RI, non-polar column, custom temperature program

Column type | Active phase | I | Reference | Comment |
---|---|---|---|---|
Packed | SE-30 | 655. | Yu and Yang, 2005 | Program: not specified |

Gas phase ion energetics data

Data compiled by: Sharon G. Lias, Rhoda D. Levin, and Sherif A. Kafafi
Ionization energy determinations
IE (eV) | Method | Reference | Comment |
---|---|---|---|
11.30 | PE | Green, Lappert, et al., 1971 | Vertical value |

References

Kreshkov, Kirichenko, et al., 1975
Kreshkov, A.P.; Kirichenko, É.A.; Markov, B.A.,
Retention indices of alkoxychlorosilanes,
Zh. Anal. Khim., 1975, 30, 2, 286-289. [all data]
Yu and Yang, 2005
Yu, X.; Yang, D.,
Predicting the Kovats retention index for alkoxyl silicon chlorides and sulfides on stationary phases of different polarity,
Fenxi Huaxue, 2005, 33, 1, 101-105. [all data]