1,1-Dicyclohexyldodecane

Condensed phase thermochemistry data

Data compiled by: Eugene S. Domalski and Elizabeth D. Hearing

Quantity Value Units Method Reference Comment
solid,1 bar130.4cal/mol*KN/AKarasharli and Strelkov, 1960
solid,1 bar130.4cal/mol*KN/AKarasharli and Strelkov, 1960, 2

Constant pressure heat capacity of solid

Cp,solid (cal/mol*K) Temperature (K) Reference Comment
134.5298.15Karasharli and Strelkov, 1960T = 10 to 300 K.
134.5298.15Karasharli and Strelkov, 1960, 2T = 10 to 300 K.

Phase change data

Data compiled as indicated in comments:
TRC - Thermodynamics Research Center, NIST Boulder Laboratories, Chris Muzny director
DH - Eugene S. Domalski and Elizabeth D. Hearing
AC - William E. Acree, Jr., James S. Chickos

Quantity Value Units Method Reference Comment
Ttriple300.58KN/AKarasharli and Strelkov, 1960, 3Uncertainty assigned by TRC = 0.02 K; TRC
Ttriple300.6KN/AKarasharli and Strelkov, 1960, 4Uncertainty assigned by TRC = 0.2 K; TRC

Enthalpy of fusion

ΔfusH (kcal/mol) Temperature (K) Reference Comment
10.580300.58Karasharli and Strelkov, 1960DH
10.580300.6Karasharli and Strelkov, 1960, 2DH
10.60300.6Domalski and Hearing, 1996AC

Entropy of fusion

ΔfusS (cal/mol*K) Temperature (K) Reference Comment
35.21300.58Karasharli and Strelkov, 1960DH
35.21300.6Karasharli and Strelkov, 1960, 2DH

In addition to the Thermodynamics Research Center (TRC) data available from this site, much more physical and chemical property data is available from the following TRC products:

References

Karasharli and Strelkov, 1960
Karasharli, K.A.; Strelkov, P.G., Thermodynamic investigations of 1,1-dicyclohexyldodecane, 1,1-diphenyldodecane, 1-phenyl-1-cyclohexyldodecane at low temperature, Dokl. Akad. Nauk, 1960, SSSR 131, 568-569. [all data]

Karasharli and Strelkov, 1960, 2
Karasharli, K.A.; Strelkov, P.G., Thermodynamic properties of dicyclohexyldodecane, Zhur. Fiz. Khim., 1960, 34, 693-695. [all data]

Karasharli and Strelkov, 1960, 3
Karasharli, K.A.; Strelkov, P.G., Thermodynamic investigations of 1,1-dicyclohexyldodecane, 1,1-diphenyldodecane, 1-phenyl-1-cyclohexyldodecane at low temp., Dokl. Akad. Nauk SSSR, 1960, 131, 568-9. [all data]

Karasharli and Strelkov, 1960, 4
Karasharli, K.A.; Strelkov, P.G., Thermodynamic properties of dicyclohexyldodecane, Zh. Fiz. Khim., 1960, 34, 693. [all data]

Domalski and Hearing, 1996
Domalski, Eugene S.; Hearing, Elizabeth D., Heat Capacities and Entropies of Organic Compounds in the Condensed Phase. Volume III, J. Phys. Chem. Ref. Data, 1996, 25, 1, 1, https://doi.org/10.1063/1.555985 . [all data]