2-Ethyl-3,3-dimethylbut-1-ene
- Formula: C8H16
- Molecular weight: 112.2126
- IUPAC Standard InChIKey: KQRPZENSXZIOQO-UHFFFAOYSA-N
- CAS Registry Number: 18231-53-3
- Chemical structure:
View 3d structure (requires JavaScript / HTML 5) - Other names: 1-Butene, 2-ethyl-3,3-dimethyl; 3,3-Dimethyl-2-ethyl-1-butene

Kovats' RI, non-polar column, isothermal

Column type | Active phase | Temperature (C) | I | Reference | Comment |
---|---|---|---|---|---|
Capillary | Petrocol DH | 30. | 739.6 | Soják, Addová, et al., 2004 | 150. m/0.25 mm/1. μm, H2 |
Capillary | Squalane | 30. | 729.5 | Soják, Addová, et al., 2004 | He; Column length: 93. m; Column diameter: 0.25 mm |
Capillary | Squalane | 40. | 731. | Matukuma, 1969 | N2; Column length: 91.4 m; Column diameter: 0.25 mm |

References

Soják, Addová, et al., 2004
Soják, L.; Addová, G.; Kubinec, R.; Kraus, A.; Bohác, A.,
Capillary gas chromatography-mass spectrometry of all 93 acyclic octenes and their identification in fluid catalytic cracked gasoline,
J. Chromatogr. A, 2004, 1025, 2, 237-253, https://doi.org/10.1016/j.chroma.2003.10.112
. [all data]
Matukuma, 1969
Matukuma, A.,
Retention indices of alkanes through C10 and alkenes through C8 and relation between boiling points and retention data,
Gas Chromatogr., Int. Symp. Anal. Instrum. Div Instrum Soc. Amer., 1969, 7, 55-75. [all data]