C3H10O4Si
- Formula: C3H10O4Si
- Molecular weight: 138.1946
- CAS Registry Number: 18230-57-4

Reaction thermochemistry data

Data compiled by: John E. Bartmess
Individual Reactions
C3H9O4Si- + = C3H10O4Si
By formula: C3H9O4Si- + H+ = C3H10O4Si
Quantity | Value | Units | Method | Reference | Comment |
---|---|---|---|---|---|
ΔrH° | 354.8 ± 4.1 | kcal/mol | G+TS | Damrauer, Simon, et al., 1991 | gas phase; Between MeSH, tBuSH |
Quantity | Value | Units | Method | Reference | Comment |
ΔrG° | 348.4 ± 4.0 | kcal/mol | IMRB | Damrauer, Simon, et al., 1991 | gas phase; Between MeSH, tBuSH |

Gas phase ion energetics data

Data compiled by: John E. Bartmess
De-protonation reactions
C3H9O4Si- + = C3H10O4Si
By formula: C3H9O4Si- + H+ = C3H10O4Si
Quantity | Value | Units | Method | Reference | Comment |
---|---|---|---|---|---|
ΔrH° | 354.8 ± 4.1 | kcal/mol | G+TS | Damrauer, Simon, et al., 1991 | gas phase; Between MeSH, tBuSH |
Quantity | Value | Units | Method | Reference | Comment |
ΔrG° | 348.4 ± 4.0 | kcal/mol | IMRB | Damrauer, Simon, et al., 1991 | gas phase; Between MeSH, tBuSH |

References

Damrauer, Simon, et al., 1991
Damrauer, R.; Simon, R.; Krempp, M.,
Effect of Substituents on the Gas-Phase Acidity of Silanols,
J. Am. Chem. Soc., 1991, 113, 12, 4431, https://doi.org/10.1021/ja00012a009
. [all data]