Bromopropylate
- Formula: C17H16Br2O3
- Molecular weight: 428.115
- IUPAC Standard InChIKey: FOANIXZHAMJWOI-UHFFFAOYSA-N
- CAS Registry Number: 18181-80-1
- Chemical structure:
View 3d structure (requires JavaScript / HTML 5) - Species with the same structure:
- Other names: Benzeneacetic acid, 4-bromo-α-(4-bromophenyl)-α-hydroxy-, 1-methylethyl ester; Benzilic acid, 4,4'-dibromo-, isopropyl ester; Acarol; Geigy 19851; GS 19851; Isopropyl dibromobenzilate; Isopropyl 4,4'-dibromobenzilate; Neoron; Bromobropylate; Phenisobromolate; Folbex VA

Phase change data

Data compiled as indicated in comments:
TRC - Thermodynamics Research Center, NIST Boulder Laboratories, Chris Muzny director
AC - William E. Acree, Jr., James S. Chickos
Quantity | Value | Units | Method | Reference | Comment |
---|---|---|---|---|---|
Tfus | 349.12 | K | N/A | Donnelly, Drewes, et al., 1990 | Uncertainty assigned by TRC = 0.2 K; TRC |
Enthalpy of fusion
ΔfusH (kJ/mol) | Temperature (K) | Reference | Comment |
---|---|---|---|
24.55 | 348.1 | Domalski and Hearing, 1996 | AC |

References

Donnelly, Drewes, et al., 1990
Donnelly, J.R.; Drewes, L.A.; Johnson, R.L.; Munslow, W.D.; Knapp, K.K.; Sovocool, G.W.,
Purity and heat of fusion data for environmental standards as determined by differential scanning calorimetry,
Thermochim. Acta, 1990, 167, 2, 155, https://doi.org/10.1016/0040-6031(90)80476-F
. [all data]
Domalski and Hearing, 1996
Domalski, Eugene S.; Hearing, Elizabeth D.,
Heat Capacities and Entropies of Organic Compounds in the Condensed Phase. Volume III,
J. Phys. Chem. Ref. Data, 1996, 25, 1, 1, https://doi.org/10.1063/1.555985
. [all data]