Benzene, (octyloxy)-
- Formula: C14H22O
- Molecular weight: 206.3239
- IUPAC Standard InChIKey: ZPIRTVJRHUMMOI-UHFFFAOYSA-N
- CAS Registry Number: 1818-07-1
- Chemical structure:
View 3d structure (requires JavaScript / HTML 5) - Other names: Ether, octyl phenyl; Octyl phenyl ether

Phase change data

Data compiled as indicated in comments:
TRC - Thermodynamics Research Center, NIST Boulder Laboratories, Chris Muzny director
BS - Robert L. Brown and Stephen E. Stein
Quantity | Value | Units | Method | Reference | Comment |
---|---|---|---|---|---|
Tboil | 557.35 | K | N/A | Perkin, 1896 | Uncertainty assigned by TRC = 1. K; TRC |
Reduced pressure boiling point
Tboil (K) | Pressure (bar) | Reference | Comment |
---|---|---|---|
438.7 | 0.027 | Weast and Grasselli, 1989 | BS |

References

Perkin, 1896
Perkin, W.H.,
LXIX. On Magnetic Rotatory Power, especially of Aromatic Compounds,
J. Chem. Soc., 1896, 69, 1025-1257. [all data]
Weast and Grasselli, 1989
CRC Handbook of Data on Organic Compounds, 2nd Editon, Weast,R.C and Grasselli, J.G., ed(s)., CRC Press, Inc., Boca Raton, FL, 1989, 1. [all data]