Benzene, (2-ethoxyethyl)-
- Formula: C10H14O
- Molecular weight: 150.2176
- IUPAC Standard InChIKey: YLQUZJVSFHZOBQ-UHFFFAOYSA-N
- CAS Registry Number: 1817-90-9
- Chemical structure:
View 3d structure (requires JavaScript / HTML 5) - Other names: Ethyl phenethyl ether; (2-ethoxyethyl)benzene

Normal alkane RI, non-polar column, custom temperature program

Column type | Active phase | I | Reference | Comment |
---|---|---|---|---|
Capillary | SE-30 | 1124. | Vinogradov, 2004 | Program: not specified |
Capillary | Polydimethyl siloxanes | 1124. | Zenkevich, 1997 | Program: not specified |

References

Vinogradov, 2004
Vinogradov, B.A.,
Production, composition, properties and application of essential oils, 2004, retrieved from http://viness.narod.ru. [all data]
Zenkevich, 1997
Zenkevich, I.G.,
Analytical Parameters of Components of Essential Oils for their Chromatographic and Chromato-Spectral Identificaiton. Oxsigenated derivatives of Mono- and Sesquiterpene Hydrocarbons,
Rastit, Resursy (Rus.), 1997, 33, 1, 16-28. [all data]