2-Ethoxypentane
- Formula: C7H16O
- Molecular weight: 116.2013
- IUPAC Standard InChIKey: XFKPOLRDQWCGPV-UHFFFAOYSA-N
- CAS Registry Number: 1817-89-6
- Chemical structure:
View 3d structure (requires JavaScript / HTML 5) - Other names: sec-Amyl ethyl ether; Pentane, 2-ethoxy-; Ethyl 1-methylbutyl ether; Ethyl 2-pentyl ether

Normal alkane RI, non-polar column, custom temperature program

Column type | Active phase | I | Reference | Comment |
---|---|---|---|---|
Capillary | Polydimethyl siloxanes | 721. | Zenkevich, 1997 | Program: not specified |
Capillary | Polydimethyl siloxanes | 772. | Zenkevich, Chupalov, et al., 1996 | Program: not specified |

Phase change data

Data compiled by: Robert L. Brown and Stephen E. Stein

Quantity Value Units Method Reference Comment
Tboil377. - 378.KN/AFrinton Laboratories Inc., 1986

References

Zenkevich, 1997
Zenkevich, I.G.,
Influence of the Variations of Dynamics Molecular Parameterts on the Additivity of Chromatigraphic Retention Indices of Products of Organic Reactions Relative to Initial Reagents,
Dokl. Akad. Nauk (Rus.), 1997, 353, 5, 625-627. [all data]
Zenkevich, Chupalov, et al., 1996
Zenkevich, I.G.; Chupalov, A.A.; Herzschuh, R.,
Correlation of the Increments of Gas Chromatographic Retention Indices with the Differences of Innermolecular Energies of Reagents and Products of Chemical Reactions,
Zh. Org. Khim. (Rus.), 1996, 32, 11, 1685-1691. [all data]